{"text_format":"3","workbook":"xlsx","n_sheets":6,"sheets":["Read me","Register","Dashboard","Total QTYs","Supplier","Cube ID"],"not_rendered":{"charts":5,"external_links":1,"defined_names":25,"comments":2},"read":"whole","date_system":"1900"}

{"sheet":"Read me","index":0,"n_rows":33,"n_cols":1,"rows_kept":33,"merged":[[0,0,4,11],[8,0,9,11],[12,0,13,11],[16,0,17,11],[20,0,21,11],[24,0,29,11],[32,0,33,11]]}
["Read Me"]
[]
[]
[]
[]
[]
[]
["1)"]
{"$rows_left_out":26}
{"sheet":"Register","index":1,"n_rows":500,"n_cols":89,"rows_kept":500,"merged":[[6,82,7,83],[6,84,7,87],[8,43,8,44],[8,45,8,46],[8,47,8,48],[8,55,8,56],[8,57,8,58],[8,59,8,60],[8,67,8,68],[8,69,8,70],[8,71,8,72],[8,82,8,83],[8,84,8,87],[9,82,9,83],[9,84,9,87],[10,82,10,83],[10,84,10,87],[11,82,11,83],[11,84,11,87],[12,82,12,83],[12,84,12,87],[13,82,13,83],[13,84,13,87],[14,82,14,83],[14,84,14,87],[15,82,15,83],[15,84,15,87],[16,82,16,83],[16,84,16,87],[17,82,17,83],[17,84,17,87],[18,82,18,83],[18,84,18,87],[19,82,19,83],[19,84,19,87],[20,82,20,83],[20,84,20,87],[21,82,21,83],[21,84,21,87],[22,82,22,83],[22,84,22,87],[23,82,23,83],[23,84,23,87],[24,82,24,83],[24,84,24,87],[25,82,25,83],[25,84,25,87],[26,82,26,83],[26,84,26,87],[27,82,27,83],[27,84,27,87],[28,82,28,83],[28,84,28,87],[29,82,29,83],[29,84,29,87],[30,82,30,83],[30,84,30,87],[31,82,31,83],[31,84,31,87],[32,82,32,83],[32,84,32,87],[33,82,33,83],[33,84,33,87],[34,82,34,83],[34,84,34,87],[35,82,35,83],[35,84,35,87],[36,82,36,83],[36,84,36,87],[37,82,37,83],[37,84,37,87],[38,82,38,83],[38,84,38,87],[39,82,39,83],[39,84,39,87],[40,82,40,83],[40,84,40,87],[41,82,41,83],[41,84,41,87],[42,82,42,83],[42,84,42,87],[43,82,43,83],[43,84,43,87],[44,82,44,83],[44,84,44,87],[45,82,45,83],[45,84,45,87],[46,82,46,83],[46,84,46,87],[47,82,47,83],[47,84,47,87],[48,82,48,83],[48,84,48,87],[49,82,49,83],[49,84,49,87],[50,82,50,83],[50,84,50,87],[51,82,51,83],[51,84,51,87],[52,82,52,83],[52,84,52,87],[53,82,53,83],[53,84,53,87],[54,82,54,83],[54,84,54,87],[55,82,55,83],[55,84,55,87],[56,82,56,83],[56,84,56,87],[57,82,57,83],[57,84,57,87],[58,82,58,83],[58,84,58,87],[59,82,59,83],[59,84,59,87],[60,82,60,83],[60,84,60,87],[61,82,61,83],[61,84,61,87],[62,82,62,83],[62,84,62,87],[63,82,63,83],[63,84,63,87],[64,82,64,83],[64,84,64,87],[65,82,65,83],[65,84,65,87],[66,82,66,83],[66,84,66,87],[67,82,67,83],[67,84,67,87],[68,82,68,83],[68,84,68,87],[69,82,69,83],[69,84,69,87],[70,82,70,83],[70,84,70,87],[71,82,71,83],[71,84,71,87],[72,82,72,83],[72,84,72,87],[73,82,73,83],[73,84,73,87],[74,82,74,83],[74,84,74,87],[75,82,75,83],[75,84,75,87],[76,82,76,83],[76,84,76,87],[77,82,77,83],[77,84,77,87],[78,82,78,83],[78,84,78,87],[79,82,79,83],[79,84,79,87],[80,82,80,83],[80,84,80,87],[81,82,81,83],[81,84,81,87],[82,82,82,83],[82,84,82,87],[83,82,83,83],[83,84,83,87],[84,82,84,83],[84,84,84,87],[85,82,85,83],[85,84,85,87],[86,82,86,83],[86,84,86,87],[87,82,87,83],[87,84,87,87],[88,82,88,83],[88,84,88,87],[89,82,89,83],[89,84,89,87],[90,82,90,83],[90,84,90,87],[91,82,91,83],[91,84,91,87],[92,82,92,83],[92,84,92,87],[93,82,93,83],[93,84,93,87],[94,82,94,83],[94,84,94,87],[95,82,95,83],[95,84,95,87],[96,82,96,83],[96,84,96,87],[97,82,97,83],[97,84,97,87],[98,82,98,83],[98,84,98,87],[99,82,99,83],[99,84,99,87],[100,82,100,83],[100,84,100,87],[101,82,101,83],[101,84,101,87],[102,82,102,83],[102,84,102,87],[103,82,103,83],[103,84,103,87],[104,82,104,83],[104,84,104,87],[105,82,105,83],[105,84,105,87],[106,82,106,83],[106,84,106,87],[107,82,107,83],[107,84,107,87],[108,82,108,83],[108,84,108,87],[109,82,109,83],[109,84,109,87],[110,82,110,83],[110,84,110,87],[111,82,111,83],[111,84,111,87],[112,82,112,83],[112,84,112,87],[113,82,113,83],[113,84,113,87],[114,82,114,83],[114,84,114,87],[115,82,115,83],[115,84,115,87],[116,82,116,83],[116,84,116,87],[117,82,117,83],[117,84,117,87],[118,82,118,83],[118,84,118,87],[119,82,119,83],[119,84,119,87],[120,82,120,83],[120,84,120,87],[121,82,121,83],[121,84,121,87],[122,82,122,83],[122,84,122,87],[123,82,123,83],[123,84,123,87],[124,82,124,83],[124,84,124,87],[125,82,125,83],[125,84,125,87],[126,82,126,83],[126,84,126,87],[127,82,127,83],[127,84,127,87],[128,82,128,83],[128,84,128,87],[129,82,129,83],[129,84,129,87],[130,82,130,83],[130,84,130,87],[131,82,131,83],[131,84,131,87],[132,82,132,83],[132,84,132,87],[133,82,133,83],[133,84,133,87],[134,82,134,83],[134,84,134,87],[135,82,135,83],[135,84,135,87],[136,82,136,83],[136,84,136,87],[137,82,137,83],[137,84,137,87],[138,82,138,83],[138,84,138,87],[139,82,139,83],[139,84,139,87],[140,82,140,83],[140,84,140,87],[141,82,141,83],[141,84,141,87],[142,82,142,83],[142,84,142,87],[143,82,143,83],[143,84,143,87],[144,82,144,83],[144,84,144,87],[145,82,145,83],[145,84,145,87],[146,82,146,83],[146,84,146,87],[147,82,147,83],[147,84,147,87],[148,82,148,83],[148,84,148,87],[149,82,149,83],[149,84,149,87],[150,82,150,83],[150,84,150,87],[151,82,151,83],[151,84,151,87],[152,82,152,83],[152,84,152,87],[153,82,153,83],[153,84,153,87],[154,82,154,83],[154,84,154,87],[155,82,155,83],[155,84,155,87],[156,82,156,83],[156,84,156,87],[157,82,157,83],[157,84,157,87],[158,82,158,83],[158,84,158,87],[159,82,159,83],[159,84,159,87],[160,82,160,83],[160,84,160,87],[161,82,161,83],[161,84,161,87],[162,82,162,83],[162,84,162,87],[163,82,163,83],[163,84,163,87],[164,82,164,83],[164,84,164,87],[165,82,165,83],[165,84,165,87],[166,82,166,83],[166,84,166,87],[167,82,167,83],[167,84,167,87],[168,82,168,83],[168,84,168,87],[169,82,169,83],[169,84,169,87],[170,82,170,83],[170,84,170,87],[171,82,171,83],[171,84,171,87],[172,82,172,83],[172,84,172,87],[173,82,173,83],[173,84,173,87],[174,82,174,83],[174,84,174,87],[175,82,175,83],[175,84,175,87],[176,82,176,83],[176,84,176,87],[177,82,177,83],[177,84,177,87],[178,82,178,83],[178,84,178,87],[179,82,179,83],[179,84,179,87],[180,82,180,83],[180,84,180,87],[181,82,181,83],[181,84,181,87],[182,82,182,83],[182,84,182,87],[183,82,183,83],[183,84,183,87],[184,82,184,83],[184,84,184,87],[185,82,185,83],[185,84,185,87],[186,82,186,83],[186,84,186,87],[187,82,187,83],[187,84,187,87],[188,82,188,83],[188,84,188,87],[189,82,189,83],[189,84,189,87],[190,82,190,83],[190,84,190,87],[191,82,191,83],[191,84,191,87],[192,82,192,83],[192,84,192,87],[193,82,193,83],[193,84,193,87],[194,84,194,87],[195,84,195,87],[196,84,196,87],[197,84,197,87],[198,84,198,87],[199,84,199,87],[200,84,200,87],[201,84,201,87],[202,84,202,87],[203,84,203,87],[204,84,204,87],[205,84,205,87],[206,84,206,87],[207,84,207,87],[208,84,208,87],[209,84,209,87],[210,84,210,87],[211,84,211,87],[212,84,212,87],[213,84,213,87],[214,84,214,87],[215,84,215,87],[216,84,216,87],[217,84,217,87],[218,84,218,87],[219,84,219,87],[220,84,220,87],[221,84,221,87],[222,84,222,87],[223,84,223,87],[224,84,224,87],[225,84,225,87],[226,84,226,87],[227,84,227,87],[228,84,228,87],[229,84,229,87],[230,84,230,87],[231,84,231,87],[232,84,232,87],[233,84,233,87],[234,84,234,87],[235,84,235,87],[236,84,236,87],[237,84,237,87],[238,84,238,87],[239,84,239,87],[240,84,240,87],[241,84,241,87],[242,84,242,87],[243,84,243,87],[244,84,244,87],[245,84,245,87],[246,84,246,87],[247,84,247,87],[248,84,248,87],[249,84,249,87],[250,84,250,87],[251,84,251,87],[252,84,252,87],[253,84,253,87],[254,84,254,87],[255,84,255,87],[256,84,256,87],[257,84,257,87],[258,84,258,87],[259,84,259,87],[260,84,260,87],[261,84,261,87],[262,84,262,87],[263,84,263,87],[264,84,264,87],[265,84,265,87],[266,84,266,87],[267,84,267,87],[268,84,268,87],[269,84,269,87],[270,84,270,87],[271,84,271,87],[272,84,272,87],[273,84,273,87],[274,82,274,83],[274,84,274,87],[275,82,275,83],[275,84,275,87],[276,82,276,83],[277,82,277,83],[278,82,278,83],[279,82,279,83],[280,82,280,83],[281,82,281,83],[282,82,282,83],[283,82,283,83],[284,82,284,83],[285,82,285,83],[286,82,286,83],[287,82,287,83],[288,82,288,83],[291,84,291,87],[292,84,292,87],[293,84,293,87],[294,84,294,87],[295,84,295,87],[296,84,296,87],[297,84,297,87],[298,84,298,87],[299,84,299,87],[300,84,300,87],[301,84,301,87],[302,84,302,87],[303,84,303,87],[304,84,304,87],[305,84,305,87],[306,84,306,87],[307,84,307,87],[308,84,308,87],[309,84,309,87],[310,84,310,87],[311,84,311,87],[312,84,312,87],[313,84,313,87],[314,84,314,87],[315,84,315,87],[316,84,316,87],[317,84,317,87],[318,84,318,87],[319,84,319,87],[320,84,320,87],[321,84,321,87],[322,82,322,83],[322,84,322,87],[323,82,323,83],[323,84,323,87],[324,82,324,83],[325,82,325,83],[326,82,326,83],[327,82,327,83],[328,82,328,83],[329,82,329,83],[330,82,330,83],[331,82,331,83],[332,82,332,83],[333,82,333,83],[334,82,334,83],[335,82,335,83],[336,82,336,83],[337,82,337,83],[338,82,338,83],[339,82,339,83],[353,84,353,87],[354,84,354,87],[355,84,355,87],[356,84,356,87],[357,84,357,87],[358,84,358,87],[359,84,359,87],[360,84,360,87],[361,84,361,87],[362,84,362,87],[363,84,363,87],[364,84,364,87],[365,84,365,87],[366,84,366,87],[367,84,367,87],[368,84,368,87],[369,84,369,87],[370,84,370,87],[371,84,371,87],[372,84,372,87],[373,84,373,87],[374,84,374,87],[375,84,375,87],[376,84,376,87],[377,84,377,87],[378,84,378,87],[379,84,379,87],[380,84,380,87],[381,84,381,87],[382,84,382,87],[383,84,383,87],[384,84,384,87],[385,84,385,87],[386,84,386,87],[387,84,387,87],[388,84,388,87],[389,84,389,87],[390,84,390,87],[391,84,391,87],[392,84,392,87],[393,84,393,87],[394,84,394,87],[395,84,395,87],[396,84,396,87],[397,84,397,87],[398,84,398,87],[399,84,399,87],[400,84,400,87],[401,84,401,87],[402,84,402,87],[403,84,403,87],[404,84,404,87],[405,84,405,87],[406,84,406,87],[407,84,407,87],[408,84,408,87],[409,84,409,87],[410,84,410,87],[411,84,411,87],[412,84,412,87],[413,84,413,87],[414,84,414,87],[415,84,415,87],[416,84,416,87],[417,82,417,83],[417,84,417,87],[418,82,418,83],[418,84,418,87],[419,82,419,83],[419,84,419,87],[420,82,420,83],[420,84,420,87],[421,84,421,87],[422,84,422,87],[423,84,423,87],[424,84,424,87],[425,84,425,87],[426,84,426,87],[427,84,427,87],[428,84,428,87],[429,82,429,83],[429,84,429,87],[430,82,430,83],[430,84,430,87],[431,82,431,83],[431,84,431,87],[432,82,432,83],[432,84,432,87],[433,82,433,83],[433,84,433,87],[434,82,434,83],[434,84,434,87],[435,82,435,83],[435,84,435,87],[436,82,436,83],[436,84,436,87],[437,82,437,83],[437,84,437,87],[438,82,438,83],[438,84,438,87],[439,82,439,83],[439,84,439,87],[440,82,440,83],[440,84,440,87],[441,82,441,83],[441,84,441,87],[442,82,442,83],[442,84,442,87],[443,82,443,83],[443,84,443,87],[444,82,444,83],[444,84,444,87],[445,82,445,83],[445,84,445,87],[446,82,446,83],[446,84,446,87],[447,82,447,83],[447,84,447,87],[448,82,448,83],[448,84,448,87],[449,82,449,83],[449,84,449,87],[450,82,450,83],[450,84,450,87],[451,82,451,83],[451,84,451,87],[452,82,452,83],[452,84,452,87],[453,82,453,83],[453,84,453,87],[454,82,454,83],[454,84,454,87],[455,82,455,83],[455,84,455,87],[456,82,456,83],[456,84,456,87],[457,82,457,83],[457,84,457,87],[458,82,458,83],[458,84,458,87],[459,82,459,83],[459,84,459,87],[460,82,460,83],[460,84,460,87],[461,82,461,83],[461,84,461,87],[462,82,462,83],[462,84,462,87],[463,82,463,83],[463,84,463,87],[464,82,464,83],[464,84,464,87],[465,82,465,83],[465,84,465,87],[466,82,466,83],[466,84,466,87],[467,82,467,83],[467,84,467,87],[468,82,468,83],[468,84,468,87],[469,82,469,83],[469,84,469,87],[470,82,470,83],[470,84,470,87],[471,82,471,83],[471,84,471,87],[472,82,472,83],[472,84,472,87],[473,82,473,83],[473,84,473,87],[474,82,474,83],[474,84,474,87],[475,82,475,83],[475,84,475,87],[476,82,476,83],[476,84,476,87],[477,82,477,83],[477,84,477,87],[478,82,478,83],[478,84,478,87],[479,82,479,83],[479,84,479,87],[480,82,480,83],[480,84,480,87],[481,82,481,83],[481,84,481,87],[482,82,482,83],[482,84,482,87],[483,82,483,83],[483,84,483,87],[484,82,484,83],[484,84,484,87],[485,82,485,83],[485,84,485,87],[486,82,486,83],[486,84,486,87],[487,82,487,83],[487,84,487,87],[488,82,488,83],[488,84,488,87],[489,82,489,83],[489,84,489,87],[490,49,490,50],[490,51,490,54],[490,55,490,56],[490,57,490,58],[490,59,490,60],[490,63,490,66],[490,67,490,68],[490,69,490,70],[490,71,490,72],[490,73,490,74],[490,75,490,77],[490,78,490,79],[490,80,490,81],[490,82,490,83],[490,84,490,87],[491,0,491,1],[491,2,491,12],[491,13,491,14],[491,15,491,26],[491,27,491,30],[491,31,491,34],[491,35,491,36],[491,37,491,38],[491,39,491,42],[491,43,491,44],[491,45,491,46],[491,47,491,48],[491,49,491,50],[491,51,491,54],[491,55,491,56],[491,57,491,58],[491,59,491,60],[491,61,491,62],[491,63,491,66],[491,67,491,68],[491,69,491,70],[491,71,491,72],[491,73,491,74],[491,75,491,77],[491,78,491,79],[491,80,491,81],[491,82,491,83],[491,84,491,87],[492,0,492,1],[492,2,492,12],[492,13,492,14],[492,15,492,26],[492,27,492,30],[492,31,492,34],[492,35,492,36],[492,37,492,38],[492,39,492,42],[492,43,492,44],[492,45,492,46],[492,47,492,48],[492,49,492,50],[492,51,492,54],[492,55,492,56],[492,57,492,58],[492,59,492,60],[492,61,492,62],[492,63,492,66],[492,67,492,68],[492,69,492,70],[492,71,492,72],[492,73,492,74],[492,75,492,77],[492,78,492,79],[492,80,492,81],[492,82,492,83],[492,84,492,87],[493,0,493,1],[493,2,493,12],[493,13,493,14],[493,15,493,26],[493,27,493,30],[493,31,493,34],[493,35,493,36],[493,37,493,38],[493,39,493,42],[493,43,493,44],[493,45,493,46],[493,47,493,48],[493,49,493,50],[493,51,493,54],[493,55,493,56],[493,57,493,58],[493,59,493,60],[493,61,493,62],[493,63,493,66],[493,67,493,68],[493,69,493,70],[493,71,493,72],[493,73,493,74],[493,75,493,77],[493,78,493,79],[493,80,493,81],[493,82,493,83],[493,84,493,87],[494,0,494,1],[494,2,494,12],[494,13,494,14],[494,15,494,26],[494,27,494,30],[494,31,494,34],[494,35,494,36],[494,37,494,38],[494,39,494,42],[494,43,494,44],[494,45,494,46],[494,47,494,48],[494,49,494,50],[494,51,494,54],[494,55,494,56],[494,57,494,58],[494,59,494,60],[494,61,494,62],[494,63,494,66],[494,67,494,68],[494,69,494,70],[494,71,494,72],[494,73,494,74],[494,75,494,77],[494,78,494,79],[494,80,494,81],[494,82,494,83],[494,84,494,87],[495,0,495,1],[495,2,495,12],[495,13,495,14],[495,15,495,26],[495,27,495,30],[495,31,495,34],[495,35,495,36],[495,37,495,38],[495,39,495,42],[495,43,495,44],[495,45,495,46],[495,47,495,48],[495,49,495,50],[495,51,495,54],[495,55,495,56],[495,57,495,58],[495,59,495,60],[495,61,495,62],[495,63,495,66],[495,67,495,68],[495,69,495,70],[495,71,495,72],[495,73,495,74],[495,75,495,77],[495,78,495,79],[495,80,495,81],[495,82,495,83],[495,84,495,87],[496,0,496,1],[496,2,496,12],[496,13,496,14],[496,15,496,26],[496,27,496,30],[496,31,496,34],[496,35,496,36],[496,37,496,38],[496,39,496,42],[496,43,496,44],[496,45,496,46],[496,47,496,48],[496,49,496,50],[496,51,496,54],[496,55,496,56],[496,57,496,58],[496,59,496,60],[496,61,496,62],[496,63,496,66],[496,67,496,68],[496,69,496,70],[496,71,496,72],[496,73,496,74],[496,75,496,77],[496,78,496,79],[496,80,496,81],[496,82,496,83],[496,84,496,87],[497,0,497,1],[497,2,497,12],[497,13,497,14],[497,15,497,26],[497,27,497,30],[497,31,497,34],[497,35,497,36],[497,37,497,38],[497,39,497,42],[497,43,497,44],[497,45,497,46],[497,47,497,48],[497,49,497,50],[497,51,497,54],[497,55,497,56],[497,57,497,58],[497,59,497,60],[497,61,497,62],[497,63,497,66],[497,67,497,68],[497,69,497,70],[497,71,497,72],[497,73,497,74],[497,75,497,77],[497,78,497,79],[497,80,497,81],[497,82,497,83],[497,84,497,87],[498,0,498,1],[498,2,498,12],[498,13,498,14],[498,15,498,26],[498,27,498,30],[498,31,498,34],[498,35,498,36],[498,37,498,38],[498,39,498,42],[498,43,498,44],[498,45,498,46],[498,47,498,48],[498,49,498,50],[498,51,498,54],[498,55,498,56],[498,57,498,58],[498,59,498,60],[498,61,498,62],[498,63,498,66],[498,67,498,68],[498,69,498,70],[498,71,498,72],[498,73,498,74],[498,75,498,77],[498,78,498,79],[498,80,498,81],[498,82,498,83],[498,84,498,87],[499,0,499,1],[499,2,499,12],[499,13,499,14],[499,15,499,26],[499,27,499,30],[499,31,499,34],[499,35,499,36],[499,37,499,38],[499,39,499,42],[499,43,499,44],[499,45,499,46],[499,47,499,48],[499,49,499,50],[499,51,499,54],[499,55,499,56],[499,57,499,58],[499,59,499,60],[499,61,499,62],[499,63,499,66],[499,67,499,68],[499,69,499,70],[499,71,499,72],[499,73,499,74],[499,75,499,77],[499,78,499,79],[499,80,499,81],[499,82,499,83],[499,84,499,87]],"merged_total":13826,"flags":["merged_cut"]}
["Project:",{"$nulls":6},"[Project Name]",{"$nulls":36},"Concrete Pouring Register"]
["Sub-Project or Phase:",{"$nulls":6},"[Sub-Project or Phase]"]
["Client:",{"$nulls":6},"[Client]",{"$nulls":36},"Project Mngr.:",{"$nulls":6},"[Proj. Mngr.]",{"$nulls":14},"Printed on",{"$nulls":6},{"$f":"TODAY()","v":"2015-03-11"}]
["Client's Representative:",{"$nulls":6},"[Client's Representative]",{"$nulls":36},"QA/QC Mngr.:",{"$nulls":6},"[QA/QC Mngr.]"]
["Contractor:",{"$nulls":6},"[Contractor]",{"$nulls":36},"Mix Design:",{"$nulls":6},"[Mix Design]"]
[{"$nulls":44},"Ref.-No.:",{"$nulls":6},"[ref.number]"]
["SN",null,"Cube ID",{"$nulls":10},"No. of Cubes",null,"Delivery Note(s)",{"$nulls":11},"Supplier",{"$nulls":3},"Concrete Poured on",{"$nulls":3},"Grade",null,"QTY\n(m3)",null,"7-days test",{"$nulls":11},"14-days test",{"$nulls":11},"28-days test",{"$nulls":14},"Cu Sum",null,"x̄",null,"Distr."]
[{"$nulls":39},"Date",{"$nulls":3},"Result (N/mm2)",{"$nulls":5},"Ø",null,"Date",{"$nulls":3},"Result (N/mm2)",{"$nulls":5},"Ø",null,"Date",{"$nulls":3},"Result (N/mm2)",{"$nulls":5},"Ø",null,"Result"]
{"$rows_left_out":493}
{"sheet":"Dashboard","index":2,"n_rows":36,"n_cols":29,"rows_kept":36,"merged":[[0,0,0,37],[1,0,1,5],[1,6,1,7],[1,20,1,25],[1,26,1,27],[2,0,2,5],[2,6,2,7],[2,20,2,25],[2,26,2,27],[3,20,3,25],[3,26,3,27],[10,0,10,7],[10,8,10,11],[10,20,10,27],[10,28,10,31],[11,0,11,7],[11,8,11,11],[11,20,11,27],[11,28,11,31],[23,0,23,1],[23,2,23,6],[23,9,23,10],[23,11,23,15],[35,0,35,1],[35,2,35,3],[35,4,35,5],[35,9,35,10],[35,11,35,12],[35,13,35,14],[35,18,35,19],[35,20,35,24]]}
[{"$f":"Register!AZ6","v":"[ref.number]"}]
["Total number of cubes",{"$nulls":5},{"$f":"SUM(Register!N10:O1048576)","v":90},{"$nulls":13},"Total number of cubes",{"$nulls":5},{"$f":"G2","v":90}]
["Concrete QTY m3",{"$nulls":5},{"$f":"SUM(Register!AL10:AM1048576)","v":198},{"$nulls":13},"Failed",{"$nulls":5},{"$f":"COUNTIF(Register!BX10:BZ1048576,U3)","v":0}]
[{"$nulls":20},"Passed",{"$nulls":5},{"$f":"COUNTIF(Register!BX10:BZ1048576,U4)","v":10}]
[]
[]
[]
[]
{"$rows_left_out":9}
{"sheet":"Total QTYs","index":3,"n_rows":34,"n_cols":45,"rows_kept":34,"merged":[[0,0,0,4],[0,5,0,25],[0,26,1,51],[1,0,1,4],[1,5,1,25],[2,0,2,4],[2,5,2,25],[2,26,2,30],[2,31,2,38],[2,39,2,43],[2,44,2,51],[3,0,3,4],[3,5,3,25],[3,26,3,30],[3,31,3,38],[3,39,3,43],[3,44,3,51],[4,0,4,4],[4,5,4,25],[4,26,4,30],[4,31,4,51],[5,0,5,4],[5,5,5,25],[5,26,5,30],[5,31,5,51],[6,0,7,1],[6,2,6,11],[6,12,6,19],[6,20,7,23],[6,24,7,27],[6,28,7,31],[6,32,7,35],[6,36,7,39],[6,40,7,51],[7,2,7,6],[7,7,7,11],[7,12,7,15],[7,16,7,19],[8,0,8,1],[8,2,8,6],[8,7,8,11],[8,12,8,15],[8,16,8,19],[8,20,8,23],[8,24,8,27],[8,28,8,31],[8,32,8,35],[8,36,8,39],[8,40,8,51],[9,0,9,1],[9,2,9,6],[9,7,9,11],[9,12,9,15],[9,16,9,19],[9,20,9,23],[9,24,9,27],[9,28,9,31],[9,32,9,35],[9,36,9,39],[9,40,9,51],[10,0,10,1],[10,2,10,6],[10,7,10,11],[10,12,10,15],[10,16,10,19],[10,20,10,23],[10,24,10,27],[10,28,10,31],[10,32,10,35],[10,36,10,39],[10,40,10,51],[11,0,11,1],[11,2,11,6],[11,7,11,11],[11,12,11,15],[11,16,11,19],[11,20,11,23],[11,24,11,27],[11,28,11,31],[11,32,11,35],[11,36,11,39],[11,40,11,51],[12,0,12,1],[12,2,12,6],[12,7,12,11],[12,12,12,15],[12,16,12,19],[12,20,12,23],[12,24,12,27],[12,28,12,31],[12,32,12,35],[12,36,12,39],[12,40,12,51],[13,0,13,1],[13,2,13,6],[13,7,13,11],[13,12,13,15],[13,16,13,19],[13,20,13,23],[13,24,13,27],[13,28,13,31],[13,32,13,35],[13,36,13,39],[13,40,13,51],[14,0,14,1],[14,2,14,6],[14,7,14,11],[14,12,14,15],[14,16,14,19],[14,20,14,23],[14,24,14,27],[14,28,14,31],[14,32,14,35],[14,36,14,39],[14,40,14,51],[15,0,15,1],[15,2,15,6],[15,7,15,11],[15,12,15,15],[15,16,15,19],[15,20,15,23],[15,24,15,27],[15,28,15,31],[15,32,15,35],[15,36,15,39],[15,40,15,51],[16,0,16,1],[16,2,16,6],[16,7,16,11],[16,12,16,15],[16,16,16,19],[16,20,16,23],[16,24,16,27],[16,28,16,31],[16,32,16,35],[16,36,16,39],[16,40,16,51],[17,0,17,1],[17,2,17,6],[17,7,17,11],[17,12,17,15],[17,16,17,19],[17,20,17,23],[17,24,17,27],[17,28,17,31],[17,32,17,35],[17,36,17,39],[17,40,17,51],[18,0,18,1],[18,2,18,6],[18,7,18,11],[18,12,18,15],[18,16,18,19],[18,20,18,23],[18,24,18,27],[18,28,18,31],[18,32,18,35],[18,36,18,39],[18,40,18,51],[19,0,19,1],[19,2,19,6],[19,7,19,11],[19,12,19,15],[19,16,19,19],[19,20,19,23],[19,24,19,27],[19,28,19,31],[19,32,19,35],[19,36,19,39],[19,40,19,51],[20,0,20,1],[20,2,20,6],[20,7,20,11],[20,12,20,15],[20,16,20,19],[20,20,20,23],[20,24,20,27],[20,28,20,31],[20,32,20,35],[20,36,20,39],[20,40,20,51],[21,0,21,1],[21,2,21,6],[21,7,21,11],[21,12,21,15],[21,16,21,19],[21,20,21,23],[21,24,21,27],[21,28,21,31],[21,32,21,35],[21,36,21,39],[21,40,21,51],[22,0,22,1],[22,2,22,6],[22,7,22,11],[22,12,22,15],[22,16,22,19],[22,20,22,23],[22,24,22,27],[22,28,22,31],[22,32,22,35],[22,36,22,39],[22,40,22,51],[23,0,23,1],[23,2,23,6],[23,7,23,11],[23,12,23,15],[23,16,23,19],[23,20,23,23],[23,24,23,27],[23,28,23,31],[23,32,23,35],[23,36,23,39],[23,40,23,51],[24,0,24,1],[24,2,24,6],[24,7,24,11],[24,12,24,15],[24,16,24,19],[24,20,24,23],[24,24,24,27],[24,28,24,31],[24,32,24,35],[24,36,24,39],[24,40,24,51],[25,0,25,1],[25,2,25,6],[25,7,25,11],[25,12,25,15],[25,16,25,19],[25,20,25,23],[25,24,25,27],[25,28,25,31],[25,32,25,35],[25,36,25,39],[25,40,25,51],[26,0,26,1],[26,2,26,6],[26,7,26,11],[26,12,26,15],[26,16,26,19],[26,20,26,23],[26,24,26,27],[26,28,26,31],[26,32,26,35],[26,36,26,39],[26,40,26,51],[27,0,27,1],[27,2,27,6],[27,7,27,11],[27,12,27,15],[27,16,27,19],[27,20,27,23],[27,24,27,27],[27,28,27,31],[27,32,27,35],[27,36,27,39],[27,40,27,51],[28,0,28,1],[28,2,28,6],[28,7,28,11],[28,12,28,15],[28,16,28,19],[28,20,28,23],[28,24,28,27],[28,28,28,31],[28,32,28,35],[28,36,28,39],[28,40,28,51],[29,0,29,1],[29,2,29,6],[29,7,29,11],[29,12,29,15],[29,16,29,19],[29,20,29,23],[29,24,29,27],[29,28,29,31],[29,32,29,35],[29,36,29,39],[29,40,29,51],[30,0,30,1],[30,2,30,6],[30,7,30,11],[30,12,30,15],[30,16,30,19],[30,20,30,23],[30,24,30,27],[30,28,30,31],[30,32,30,35],[30,36,30,39],[30,40,30,51],[31,0,31,1],[31,2,31,6],[31,7,31,11],[31,12,31,15],[31,16,31,19],[31,20,31,23],[31,24,31,27],[31,28,31,31],[31,32,31,35],[31,36,31,39],[31,40,31,51],[32,0,32,1],[32,2,32,6],[32,7,32,11],[32,12,32,15],[32,16,32,19],[32,20,32,23],[32,24,32,27],[32,28,32,31],[32,32,32,35],[32,36,32,39],[32,40,32,51],[33,12,33,15],[33,16,33,19],[33,20,33,23],[33,24,33,27],[33,28,33,31],[33,32,33,35],[33,36,33,39]]}
["Project:",{"$nulls":4},{"$f":"IF(Register!H1=\"\",\"\",Register!H1)","v":"[Project Name]"},{"$nulls":20},"Total Concrete QTYs"]
["Sub-Project or Phase:",{"$nulls":4},{"$f":"IF(Register!H2=\"\",\"\",Register!H2)","v":"[Sub-Project or Phase]"}]
["Client:",{"$nulls":4},{"$f":"IF(Register!H3=\"\",\"\",Register!H3)","v":"[Client]"},{"$nulls":20},"Project Mngr.:",{"$nulls":4},{"$f":"IF(Register!AZ3=\"\",\"\",Register!AZ3)","v":"[Proj. Mngr.]"},{"$nulls":7},"Printed on",{"$nulls":4},{"$f":"TODAY()","v":"2015-03-11"}]
["Client's Repres.:",{"$nulls":4},{"$f":"IF(Register!H4=\"\",\"\",Register!H4)","v":"[Client's Representative]"},{"$nulls":20},"QA/QC Mngr.:",{"$nulls":4},{"$f":"IF(Register!AZ4=\"\",\"\",Register!AZ4)","v":"[QA/QC Mngr.]"}]
["Contractor:",{"$nulls":4},{"$f":"IF(Register!H5=\"\",\"\",Register!H5)","v":"[Contractor]"},{"$nulls":20},"Mix Design:",{"$nulls":4},{"$f":"Register!AZ5","v":"[Mix Design]"}]
[{"$nulls":5},{"$f":"IF(Register!H6=\"\",\"\",Register!H6)","v":""},{"$nulls":20},"Ref.-No.:",{"$nulls":4},"[ref. no.]"]
["SN",null,"Period",{"$nulls":9},"Consumption",{"$nulls":7},{"$f":"IF(Supplier!$A1=\"\",\"\",Supplier!$A1)","v":"Supplier A"},{"$nulls":3},{"$f":"IF(Supplier!$A2=\"\",\"\",Supplier!$A2)","v":"Supplier B"},{"$nulls":3},{"$f":"IF(Supplier!$A3=\"\",\"\",Supplier!$A3)","v":"Supplier C"},{"$nulls":3},{"$f":"IF(Supplier!$A4=\"\",\"\",Supplier!$A4)","v":"Supplier D"},{"$nulls":3},{"$f":"IF(Supplier!$A5=\"\",\"\",Supplier!$A5)","v":"Supplier E"},{"$nulls":3},"Remarks"]
[null,null,"Start",{"$nulls":4},"End",{"$nulls":4},"This Period",{"$nulls":3},"Cummulative"]
{"$rows_left_out":27}
{"sheet":"Supplier","index":4,"n_rows":5,"n_cols":1,"rows_kept":5}
["Supplier A"]
["Supplier B"]
["Supplier C"]
["Supplier D"]
["Supplier E"]

{"sheet":"Cube ID","index":5,"n_rows":18,"n_cols":9,"rows_kept":18,"merged":[[0,0,0,1],[0,2,0,3],[0,4,0,5],[0,6,0,7],[0,8,17,11]]}
[{"$f":"IF('[1]WBS ID'!A2=0,\"\",'[1]WBS ID'!A2)","v":"Location"},null,"Area",null,{"$f":"IF('[1]WBS ID'!E2=0,\"\",'[1]WBS ID'!E2)","v":"Item"},null,"Narration",null,"This table technically is without function and just provides a sample how to build a cube ID."]
["B1","Building 1","GN","Site/General",{"$f":"IF('[1]WBS ID'!E3=0,\"\",'[1]WBS ID'!E3)","v":"CL"},"Column","A1:B5","here Gridline A1 - B5"]
["B2","Building 2","BM","Basement",{"$f":"IF('[1]WBS ID'!E4=0,\"\",'[1]WBS ID'!E4)","v":"GB"},"Ground Beam","…"]
["B3","Building 3","GF","Groundfloor",{"$f":"IF('[1]WBS ID'!E5=0,\"\",'[1]WBS ID'!E5)","v":"IB"},"Intermediate Beam"]
["GN","General","MF","Mezzanine Floor","SL","Slab"]
[null,null,"F1","Floor 1","WA","Wall"]
[null,null,{"$f":"IF('[1]WBS ID'!C8=0,\"\",'[1]WBS ID'!C8)","v":"…"}]
[null,null,"F11","Floor 11"]
{"$rows_left_out":10}