{"text_format":"3","workbook":"xlsx","n_sheets":6,"sheets":["Read me","Register","Dashboard","Total QTYs","Supplier","Cube ID"],"not_rendered":{"charts":5,"external_links":1,"defined_names":25,"comments":2},"read":"whole","date_system":"1900"}

{"sheet":"Read me","index":0,"n_rows":33,"n_cols":1,"rows_kept":33,"merged":[[0,0,4,11],[8,0,9,11],[12,0,13,11],[16,0,17,11],[20,0,21,11],[24,0,29,11],[32,0,33,11]]}
["Read Me"]
[]
[]
[]
[]
[]
[]
["1)"]
["Dear User, thank you for using my template. Please remove sample entries from the register"]
[]
[]
["2)"]
["A register is designed to be filled with data for ONLY ONE type (grade) of concrete.\nConsequently you have to use separate registers if you are using different concrete mixes."]
[]
[]
["3)"]
["Usually only cells on the sheet \"Register\" require data-entry. Cells containing formulas or functions are protected, the password is blank should you wish to modify anything."]
[]
[]
["4)"]
["To avoid typing mistakes resulting in incorrect filter results, the entries in the column \"Supplier\" are restricted. To modify acceptable values change entries on the sheet \"Supplier\"."]
[]
[]
["5)"]
["To get correct charts, keep controlling that the entire range of data is covered. By default only the entries until line 100 are covered by charts 3 & 4 on the dashboard and only as many entries as existing are covered by chart 5. Chart 5 therefore has to be checked often.\nFor adjustment right click the chart area and choose \"Select Data\" from the menue. In the \"Select Data Source\" window one by one update the series by changing the \"Series Values\" (you may find something like \"='Register'!$CC$10:$CC$100\", just change the \"100\" to \"200\" etc.)."]
[]
[]
[]
[]
[]
[]
["6)"]
["On the sheet \"Total QTYs\" only enter the start date in the first line of the table. Everything else will update automatically."]

{"sheet":"Register","index":1,"n_rows":500,"n_cols":89,"rows_kept":500,"merged":[[6,82,7,83],[6,84,7,87],[8,43,8,44],[8,45,8,46],[8,47,8,48],[8,55,8,56],[8,57,8,58],[8,59,8,60],[8,67,8,68],[8,69,8,70],[8,71,8,72],[8,82,8,83],[8,84,8,87],[9,82,9,83],[9,84,9,87],[10,82,10,83],[10,84,10,87],[11,82,11,83],[11,84,11,87],[12,82,12,83],[12,84,12,87],[13,82,13,83],[13,84,13,87],[14,82,14,83],[14,84,14,87],[15,82,15,83],[15,84,15,87],[16,82,16,83],[16,84,16,87],[17,82,17,83],[17,84,17,87],[18,82,18,83],[18,84,18,87],[19,82,19,83],[19,84,19,87],[20,82,20,83],[20,84,20,87],[21,82,21,83],[21,84,21,87],[22,82,22,83],[22,84,22,87],[23,82,23,83],[23,84,23,87],[24,82,24,83],[24,84,24,87],[25,82,25,83],[25,84,25,87],[26,82,26,83],[26,84,26,87],[27,82,27,83],[27,84,27,87],[28,82,28,83],[28,84,28,87],[29,82,29,83],[29,84,29,87],[30,82,30,83],[30,84,30,87],[31,82,31,83],[31,84,31,87],[32,82,32,83],[32,84,32,87],[33,82,33,83],[33,84,33,87],[34,82,34,83],[34,84,34,87],[35,82,35,83],[35,84,35,87],[36,82,36,83],[36,84,36,87],[37,82,37,83],[37,84,37,87],[38,82,38,83],[38,84,38,87],[39,82,39,83],[39,84,39,87],[40,82,40,83],[40,84,40,87],[41,82,41,83],[41,84,41,87],[42,82,42,83],[42,84,42,87],[43,82,43,83],[43,84,43,87],[44,82,44,83],[44,84,44,87],[45,82,45,83],[45,84,45,87],[46,82,46,83],[46,84,46,87],[47,82,47,83],[47,84,47,87],[48,82,48,83],[48,84,48,87],[49,82,49,83],[49,84,49,87],[50,82,50,83],[50,84,50,87],[51,82,51,83],[51,84,51,87],[52,82,52,83],[52,84,52,87],[53,82,53,83],[53,84,53,87],[54,82,54,83],[54,84,54,87],[55,82,55,83],[55,84,55,87],[56,82,56,83],[56,84,56,87],[57,82,57,83],[57,84,57,87],[58,82,58,83],[58,84,58,87],[59,82,59,83],[59,84,59,87],[60,82,60,83],[60,84,60,87],[61,82,61,83],[61,84,61,87],[62,82,62,83],[62,84,62,87],[63,82,63,83],[63,84,63,87],[64,82,64,83],[64,84,64,87],[65,82,65,83],[65,84,65,87],[66,82,66,83],[66,84,66,87],[67,82,67,83],[67,84,67,87],[68,82,68,83],[68,84,68,87],[69,82,69,83],[69,84,69,87],[70,82,70,83],[70,84,70,87],[71,82,71,83],[71,84,71,87],[72,82,72,83],[72,84,72,87],[73,82,73,83],[73,84,73,87],[74,82,74,83],[74,84,74,87],[75,82,75,83],[75,84,75,87],[76,82,76,83],[76,84,76,87],[77,82,77,83],[77,84,77,87],[78,82,78,83],[78,84,78,87],[79,82,79,83],[79,84,79,87],[80,82,80,83],[80,84,80,87],[81,82,81,83],[81,84,81,87],[82,82,82,83],[82,84,82,87],[83,82,83,83],[83,84,83,87],[84,82,84,83],[84,84,84,87],[85,82,85,83],[85,84,85,87],[86,82,86,83],[86,84,86,87],[87,82,87,83],[87,84,87,87],[88,82,88,83],[88,84,88,87],[89,82,89,83],[89,84,89,87],[90,82,90,83],[90,84,90,87],[91,82,91,83],[91,84,91,87],[92,82,92,83],[92,84,92,87],[93,82,93,83],[93,84,93,87],[94,82,94,83],[94,84,94,87],[95,82,95,83],[95,84,95,87],[96,82,96,83],[96,84,96,87],[97,82,97,83],[97,84,97,87],[98,82,98,83],[98,84,98,87],[99,82,99,83],[99,84,99,87],[100,82,100,83],[100,84,100,87],[101,82,101,83],[101,84,101,87],[102,82,102,83],[102,84,102,87],[103,82,103,83],[103,84,103,87],[104,82,104,83],[104,84,104,87],[105,82,105,83],[105,84,105,87],[106,82,106,83],[106,84,106,87],[107,82,107,83],[107,84,107,87],[108,82,108,83],[108,84,108,87],[109,82,109,83],[109,84,109,87],[110,82,110,83],[110,84,110,87],[111,82,111,83],[111,84,111,87],[112,82,112,83],[112,84,112,87],[113,82,113,83],[113,84,113,87],[114,82,114,83],[114,84,114,87],[115,82,115,83],[115,84,115,87],[116,82,116,83],[116,84,116,87],[117,82,117,83],[117,84,117,87],[118,82,118,83],[118,84,118,87],[119,82,119,83],[119,84,119,87],[120,82,120,83],[120,84,120,87],[121,82,121,83],[121,84,121,87],[122,82,122,83],[122,84,122,87],[123,82,123,83],[123,84,123,87],[124,82,124,83],[124,84,124,87],[125,82,125,83],[125,84,125,87],[126,82,126,83],[126,84,126,87],[127,82,127,83],[127,84,127,87],[128,82,128,83],[128,84,128,87],[129,82,129,83],[129,84,129,87],[130,82,130,83],[130,84,130,87],[131,82,131,83],[131,84,131,87],[132,82,132,83],[132,84,132,87],[133,82,133,83],[133,84,133,87],[134,82,134,83],[134,84,134,87],[135,82,135,83],[135,84,135,87],[136,82,136,83],[136,84,136,87],[137,82,137,83],[137,84,137,87],[138,82,138,83],[138,84,138,87],[139,82,139,83],[139,84,139,87],[140,82,140,83],[140,84,140,87],[141,82,141,83],[141,84,141,87],[142,82,142,83],[142,84,142,87],[143,82,143,83],[143,84,143,87],[144,82,144,83],[144,84,144,87],[145,82,145,83],[145,84,145,87],[146,82,146,83],[146,84,146,87],[147,82,147,83],[147,84,147,87],[148,82,148,83],[148,84,148,87],[149,82,149,83],[149,84,149,87],[150,82,150,83],[150,84,150,87],[151,82,151,83],[151,84,151,87],[152,82,152,83],[152,84,152,87],[153,82,153,83],[153,84,153,87],[154,82,154,83],[154,84,154,87],[155,82,155,83],[155,84,155,87],[156,82,156,83],[156,84,156,87],[157,82,157,83],[157,84,157,87],[158,82,158,83],[158,84,158,87],[159,82,159,83],[159,84,159,87],[160,82,160,83],[160,84,160,87],[161,82,161,83],[161,84,161,87],[162,82,162,83],[162,84,162,87],[163,82,163,83],[163,84,163,87],[164,82,164,83],[164,84,164,87],[165,82,165,83],[165,84,165,87],[166,82,166,83],[166,84,166,87],[167,82,167,83],[167,84,167,87],[168,82,168,83],[168,84,168,87],[169,82,169,83],[169,84,169,87],[170,82,170,83],[170,84,170,87],[171,82,171,83],[171,84,171,87],[172,82,172,83],[172,84,172,87],[173,82,173,83],[173,84,173,87],[174,82,174,83],[174,84,174,87],[175,82,175,83],[175,84,175,87],[176,82,176,83],[176,84,176,87],[177,82,177,83],[177,84,177,87],[178,82,178,83],[178,84,178,87],[179,82,179,83],[179,84,179,87],[180,82,180,83],[180,84,180,87],[181,82,181,83],[181,84,181,87],[182,82,182,83],[182,84,182,87],[183,82,183,83],[183,84,183,87],[184,82,184,83],[184,84,184,87],[185,82,185,83],[185,84,185,87],[186,82,186,83],[186,84,186,87],[187,82,187,83],[187,84,187,87],[188,82,188,83],[188,84,188,87],[189,82,189,83],[189,84,189,87],[190,82,190,83],[190,84,190,87],[191,82,191,83],[191,84,191,87],[192,82,192,83],[192,84,192,87],[193,82,193,83],[193,84,193,87],[194,84,194,87],[195,84,195,87],[196,84,196,87],[197,84,197,87],[198,84,198,87],[199,84,199,87],[200,84,200,87],[201,84,201,87],[202,84,202,87],[203,84,203,87],[204,84,204,87],[205,84,205,87],[206,84,206,87],[207,84,207,87],[208,84,208,87],[209,84,209,87],[210,84,210,87],[211,84,211,87],[212,84,212,87],[213,84,213,87],[214,84,214,87],[215,84,215,87],[216,84,216,87],[217,84,217,87],[218,84,218,87],[219,84,219,87],[220,84,220,87],[221,84,221,87],[222,84,222,87],[223,84,223,87],[224,84,224,87],[225,84,225,87],[226,84,226,87],[227,84,227,87],[228,84,228,87],[229,84,229,87],[230,84,230,87],[231,84,231,87],[232,84,232,87],[233,84,233,87],[234,84,234,87],[235,84,235,87],[236,84,236,87],[237,84,237,87],[238,84,238,87],[239,84,239,87],[240,84,240,87],[241,84,241,87],[242,84,242,87],[243,84,243,87],[244,84,244,87],[245,84,245,87],[246,84,246,87],[247,84,247,87],[248,84,248,87],[249,84,249,87],[250,84,250,87],[251,84,251,87],[252,84,252,87],[253,84,253,87],[254,84,254,87],[255,84,255,87],[256,84,256,87],[257,84,257,87],[258,84,258,87],[259,84,259,87],[260,84,260,87],[261,84,261,87],[262,84,262,87],[263,84,263,87],[264,84,264,87],[265,84,265,87],[266,84,266,87],[267,84,267,87],[268,84,268,87],[269,84,269,87],[270,84,270,87],[271,84,271,87],[272,84,272,87],[273,84,273,87],[274,82,274,83],[274,84,274,87],[275,82,275,83],[275,84,275,87],[276,82,276,83],[277,82,277,83],[278,82,278,83],[279,82,279,83],[280,82,280,83],[281,82,281,83],[282,82,282,83],[283,82,283,83],[284,82,284,83],[285,82,285,83],[286,82,286,83],[287,82,287,83],[288,82,288,83],[291,84,291,87],[292,84,292,87],[293,84,293,87],[294,84,294,87],[295,84,295,87],[296,84,296,87],[297,84,297,87],[298,84,298,87],[299,84,299,87],[300,84,300,87],[301,84,301,87],[302,84,302,87],[303,84,303,87],[304,84,304,87],[305,84,305,87],[306,84,306,87],[307,84,307,87],[308,84,308,87],[309,84,309,87],[310,84,310,87],[311,84,311,87],[312,84,312,87],[313,84,313,87],[314,84,314,87],[315,84,315,87],[316,84,316,87],[317,84,317,87],[318,84,318,87],[319,84,319,87],[320,84,320,87],[321,84,321,87],[322,82,322,83],[322,84,322,87],[323,82,323,83],[323,84,323,87],[324,82,324,83],[325,82,325,83],[326,82,326,83],[327,82,327,83],[328,82,328,83],[329,82,329,83],[330,82,330,83],[331,82,331,83],[332,82,332,83],[333,82,333,83],[334,82,334,83],[335,82,335,83],[336,82,336,83],[337,82,337,83],[338,82,338,83],[339,82,339,83],[353,84,353,87],[354,84,354,87],[355,84,355,87],[356,84,356,87],[357,84,357,87],[358,84,358,87],[359,84,359,87],[360,84,360,87],[361,84,361,87],[362,84,362,87],[363,84,363,87],[364,84,364,87],[365,84,365,87],[366,84,366,87],[367,84,367,87],[368,84,368,87],[369,84,369,87],[370,84,370,87],[371,84,371,87],[372,84,372,87],[373,84,373,87],[374,84,374,87],[375,84,375,87],[376,84,376,87],[377,84,377,87],[378,84,378,87],[379,84,379,87],[380,84,380,87],[381,84,381,87],[382,84,382,87],[383,84,383,87],[384,84,384,87],[385,84,385,87],[386,84,386,87],[387,84,387,87],[388,84,388,87],[389,84,389,87],[390,84,390,87],[391,84,391,87],[392,84,392,87],[393,84,393,87],[394,84,394,87],[395,84,395,87],[396,84,396,87],[397,84,397,87],[398,84,398,87],[399,84,399,87],[400,84,400,87],[401,84,401,87],[402,84,402,87],[403,84,403,87],[404,84,404,87],[405,84,405,87],[406,84,406,87],[407,84,407,87],[408,84,408,87],[409,84,409,87],[410,84,410,87],[411,84,411,87],[412,84,412,87],[413,84,413,87],[414,84,414,87],[415,84,415,87],[416,84,416,87],[417,82,417,83],[417,84,417,87],[418,82,418,83],[418,84,418,87],[419,82,419,83],[419,84,419,87],[420,82,420,83],[420,84,420,87],[421,84,421,87],[422,84,422,87],[423,84,423,87],[424,84,424,87],[425,84,425,87],[426,84,426,87],[427,84,427,87],[428,84,428,87],[429,82,429,83],[429,84,429,87],[430,82,430,83],[430,84,430,87],[431,82,431,83],[431,84,431,87],[432,82,432,83],[432,84,432,87],[433,82,433,83],[433,84,433,87],[434,82,434,83],[434,84,434,87],[435,82,435,83],[435,84,435,87],[436,82,436,83],[436,84,436,87],[437,82,437,83],[437,84,437,87],[438,82,438,83],[438,84,438,87],[439,82,439,83],[439,84,439,87],[440,82,440,83],[440,84,440,87],[441,82,441,83],[441,84,441,87],[442,82,442,83],[442,84,442,87],[443,82,443,83],[443,84,443,87],[444,82,444,83],[444,84,444,87],[445,82,445,83],[445,84,445,87],[446,82,446,83],[446,84,446,87],[447,82,447,83],[447,84,447,87],[448,82,448,83],[448,84,448,87],[449,82,449,83],[449,84,449,87],[450,82,450,83],[450,84,450,87],[451,82,451,83],[451,84,451,87],[452,82,452,83],[452,84,452,87],[453,82,453,83],[453,84,453,87],[454,82,454,83],[454,84,454,87],[455,82,455,83],[455,84,455,87],[456,82,456,83],[456,84,456,87],[457,82,457,83],[457,84,457,87],[458,82,458,83],[458,84,458,87],[459,82,459,83],[459,84,459,87],[460,82,460,83],[460,84,460,87],[461,82,461,83],[461,84,461,87],[462,82,462,83],[462,84,462,87],[463,82,463,83],[463,84,463,87],[464,82,464,83],[464,84,464,87],[465,82,465,83],[465,84,465,87],[466,82,466,83],[466,84,466,87],[467,82,467,83],[467,84,467,87],[468,82,468,83],[468,84,468,87],[469,82,469,83],[469,84,469,87],[470,82,470,83],[470,84,470,87],[471,82,471,83],[471,84,471,87],[472,82,472,83],[472,84,472,87],[473,82,473,83],[473,84,473,87],[474,82,474,83],[474,84,474,87],[475,82,475,83],[475,84,475,87],[476,82,476,83],[476,84,476,87],[477,82,477,83],[477,84,477,87],[478,82,478,83],[478,84,478,87],[479,82,479,83],[479,84,479,87],[480,82,480,83],[480,84,480,87],[481,82,481,83],[481,84,481,87],[482,82,482,83],[482,84,482,87],[483,82,483,83],[483,84,483,87],[484,82,484,83],[484,84,484,87],[485,82,485,83],[485,84,485,87],[486,82,486,83],[486,84,486,87],[487,82,487,83],[487,84,487,87],[488,82,488,83],[488,84,488,87],[489,82,489,83],[489,84,489,87],[490,49,490,50],[490,51,490,54],[490,55,490,56],[490,57,490,58],[490,59,490,60],[490,63,490,66],[490,67,490,68],[490,69,490,70],[490,71,490,72],[490,73,490,74],[490,75,490,77],[490,78,490,79],[490,80,490,81],[490,82,490,83],[490,84,490,87],[491,0,491,1],[491,2,491,12],[491,13,491,14],[491,15,491,26],[491,27,491,30],[491,31,491,34],[491,35,491,36],[491,37,491,38],[491,39,491,42],[491,43,491,44],[491,45,491,46],[491,47,491,48],[491,49,491,50],[491,51,491,54],[491,55,491,56],[491,57,491,58],[491,59,491,60],[491,61,491,62],[491,63,491,66],[491,67,491,68],[491,69,491,70],[491,71,491,72],[491,73,491,74],[491,75,491,77],[491,78,491,79],[491,80,491,81],[491,82,491,83],[491,84,491,87],[492,0,492,1],[492,2,492,12],[492,13,492,14],[492,15,492,26],[492,27,492,30],[492,31,492,34],[492,35,492,36],[492,37,492,38],[492,39,492,42],[492,43,492,44],[492,45,492,46],[492,47,492,48],[492,49,492,50],[492,51,492,54],[492,55,492,56],[492,57,492,58],[492,59,492,60],[492,61,492,62],[492,63,492,66],[492,67,492,68],[492,69,492,70],[492,71,492,72],[492,73,492,74],[492,75,492,77],[492,78,492,79],[492,80,492,81],[492,82,492,83],[492,84,492,87],[493,0,493,1],[493,2,493,12],[493,13,493,14],[493,15,493,26],[493,27,493,30],[493,31,493,34],[493,35,493,36],[493,37,493,38],[493,39,493,42],[493,43,493,44],[493,45,493,46],[493,47,493,48],[493,49,493,50],[493,51,493,54],[493,55,493,56],[493,57,493,58],[493,59,493,60],[493,61,493,62],[493,63,493,66],[493,67,493,68],[493,69,493,70],[493,71,493,72],[493,73,493,74],[493,75,493,77],[493,78,493,79],[493,80,493,81],[493,82,493,83],[493,84,493,87],[494,0,494,1],[494,2,494,12],[494,13,494,14],[494,15,494,26],[494,27,494,30],[494,31,494,34],[494,35,494,36],[494,37,494,38],[494,39,494,42],[494,43,494,44],[494,45,494,46],[494,47,494,48],[494,49,494,50],[494,51,494,54],[494,55,494,56],[494,57,494,58],[494,59,494,60],[494,61,494,62],[494,63,494,66],[494,67,494,68],[494,69,494,70],[494,71,494,72],[494,73,494,74],[494,75,494,77],[494,78,494,79],[494,80,494,81],[494,82,494,83],[494,84,494,87],[495,0,495,1],[495,2,495,12],[495,13,495,14],[495,15,495,26],[495,27,495,30],[495,31,495,34],[495,35,495,36],[495,37,495,38],[495,39,495,42],[495,43,495,44],[495,45,495,46],[495,47,495,48],[495,49,495,50],[495,51,495,54],[495,55,495,56],[495,57,495,58],[495,59,495,60],[495,61,495,62],[495,63,495,66],[495,67,495,68],[495,69,495,70],[495,71,495,72],[495,73,495,74],[495,75,495,77],[495,78,495,79],[495,80,495,81],[495,82,495,83],[495,84,495,87],[496,0,496,1],[496,2,496,12],[496,13,496,14],[496,15,496,26],[496,27,496,30],[496,31,496,34],[496,35,496,36],[496,37,496,38],[496,39,496,42],[496,43,496,44],[496,45,496,46],[496,47,496,48],[496,49,496,50],[496,51,496,54],[496,55,496,56],[496,57,496,58],[496,59,496,60],[496,61,496,62],[496,63,496,66],[496,67,496,68],[496,69,496,70],[496,71,496,72],[496,73,496,74],[496,75,496,77],[496,78,496,79],[496,80,496,81],[496,82,496,83],[496,84,496,87],[497,0,497,1],[497,2,497,12],[497,13,497,14],[497,15,497,26],[497,27,497,30],[497,31,497,34],[497,35,497,36],[497,37,497,38],[497,39,497,42],[497,43,497,44],[497,45,497,46],[497,47,497,48],[497,49,497,50],[497,51,497,54],[497,55,497,56],[497,57,497,58],[497,59,497,60],[497,61,497,62],[497,63,497,66],[497,67,497,68],[497,69,497,70],[497,71,497,72],[497,73,497,74],[497,75,497,77],[497,78,497,79],[497,80,497,81],[497,82,497,83],[497,84,497,87],[498,0,498,1],[498,2,498,12],[498,13,498,14],[498,15,498,26],[498,27,498,30],[498,31,498,34],[498,35,498,36],[498,37,498,38],[498,39,498,42],[498,43,498,44],[498,45,498,46],[498,47,498,48],[498,49,498,50],[498,51,498,54],[498,55,498,56],[498,57,498,58],[498,59,498,60],[498,61,498,62],[498,63,498,66],[498,67,498,68],[498,69,498,70],[498,71,498,72],[498,73,498,74],[498,75,498,77],[498,78,498,79],[498,80,498,81],[498,82,498,83],[498,84,498,87],[499,0,499,1],[499,2,499,12],[499,13,499,14],[499,15,499,26],[499,27,499,30],[499,31,499,34],[499,35,499,36],[499,37,499,38],[499,39,499,42],[499,43,499,44],[499,45,499,46],[499,47,499,48],[499,49,499,50],[499,51,499,54],[499,55,499,56],[499,57,499,58],[499,59,499,60],[499,61,499,62],[499,63,499,66],[499,67,499,68],[499,69,499,70],[499,71,499,72],[499,73,499,74],[499,75,499,77],[499,78,499,79],[499,80,499,81],[499,82,499,83],[499,84,499,87]],"merged_total":13826,"flags":["merged_cut"]}
["Project:",{"$nulls":6},"[Project Name]",{"$nulls":36},"Concrete Pouring Register"]
["Sub-Project or Phase:",{"$nulls":6},"[Sub-Project or Phase]"]
["Client:",{"$nulls":6},"[Client]",{"$nulls":36},"Project Mngr.:",{"$nulls":6},"[Proj. Mngr.]",{"$nulls":14},"Printed on",{"$nulls":6},{"$f":"TODAY()","v":"2015-03-11"}]
["Client's Representative:",{"$nulls":6},"[Client's Representative]",{"$nulls":36},"QA/QC Mngr.:",{"$nulls":6},"[QA/QC Mngr.]"]
["Contractor:",{"$nulls":6},"[Contractor]",{"$nulls":36},"Mix Design:",{"$nulls":6},"[Mix Design]"]
[{"$nulls":44},"Ref.-No.:",{"$nulls":6},"[ref.number]"]
["SN",null,"Cube ID",{"$nulls":10},"No. of Cubes",null,"Delivery Note(s)",{"$nulls":11},"Supplier",{"$nulls":3},"Concrete Poured on",{"$nulls":3},"Grade",null,"QTY\n(m3)",null,"7-days test",{"$nulls":11},"14-days test",{"$nulls":11},"28-days test",{"$nulls":14},"Cu Sum",null,"x̄",null,"Distr."]
[{"$nulls":39},"Date",{"$nulls":3},"Result (N/mm2)",{"$nulls":5},"Ø",null,"Date",{"$nulls":3},"Result (N/mm2)",{"$nulls":5},"Ø",null,"Date",{"$nulls":3},"Result (N/mm2)",{"$nulls":5},"Ø",null,"Result"]
["A",null,"B",{"$nulls":10},"C",null,"D",{"$nulls":11},"E",{"$nulls":3},"F",{"$nulls":3},"G",null,"H",null,"I1",{"$nulls":3},"I2",null,"I3",null,"I4",null,"I5",null,"J1",{"$nulls":3},"J2",null,"J3",null,"J4",null,"J5",null,"K1",{"$nulls":3},"K2",null,"K3",null,"K4",null,"K5",null,"K6",null,null,"L",null,"M",null,"N"]
[{"v":1,"d":"0001"},null,"B1-BM-GB-A1:A10 - 01/01/2015",{"$nulls":10},9,null,"1234, 1235, 1236",{"$nulls":11},"Supplier A",{"$nulls":3},"2015-01-01",{"$nulls":3},37,null,{"v":19,"d":"19.0"},null,"2015-01-08",{"$nulls":3},35.1,null,{"v":34,"d":"34.0"},null,35.3,null,{"$f":"IF(SUM(AR10:AW10)=0,\"\",AVERAGE(AR10:AW10))","v":34.8},null,"2015-01-15",{"$nulls":3},37.9,null,37.3,null,38.3,null,{"$f":"IF(SUM(BD10:BI10)=0,\"\",AVERAGE(BD10:BI10))","v":{"v":37.83333333333333,"d":"37.8"}},null,"2015-01-29",{"$nulls":3},39.7,null,38.9,null,39.9,null,{"$f":"IF(SUM(BP10:BU10)=0,\"\",AVERAGE(BP10:BU10))","v":39.5},null,"Passed",null,null,{"$f":"IF(BV10=\"\",\"\",BV10-AJ10)","v":2.5},null,{"$f":"IF(BV10=\"\",\"\",AVERAGE($BV$10:BV10))","v":39.5},null,{"$f":"IF(BV10=\"\",\"\",_xlfn.NORM.DIST(BV10,AVERAGE($BV$10:$BV$5000),Dashboard!$L$36,FALSE))","v":{"v":0.4243582209377165,"d":"0.424"}}]
[{"v":2,"d":"0002"},null,"B2-BM-GB-A1:A10 - 01/01/2015",{"$nulls":10},9,null,"1237, 1238, 1239",{"$nulls":11},"Supplier B",{"$nulls":3},"2015-01-01",{"$nulls":3},37,null,{"v":19,"d":"19.0"},null,"2015-01-08",{"$nulls":3},35.3,null,34.1,null,35.2,null,{"v":34.86666666666667,"d":"34.9"},null,"2015-01-15",{"$nulls":3},38.1,null,37.4,null,38.2,null,37.9,null,"2015-01-29",{"$nulls":3},39.9,null,{"v":39,"d":"39.0"},null,39.8,null,{"v":39.56666666666667,"d":"39.6"},null,"Passed",null,null,{"v":2.56666666666667,"d":"2.6"},null,{"$f":"IF(BV11=\"\",\"\",AVERAGE($BV$10:BV11))","v":{"v":39.53333333333333,"d":"39.5"}},null,{"$f":"IF(BV11=\"\",\"\",_xlfn.NORM.DIST(BV11,AVERAGE($BV$10:$BV$5000),Dashboard!$L$36,FALSE))","v":{"v":0.44816382928119314,"d":"0.448"}}]
[{"v":3,"d":"0003"},null,"B3-BM-GB-A1:A10 - 01/01/2015",{"$nulls":10},9,null,"1240, 1241, 1242",{"$nulls":11},"Supplier C",{"$nulls":3},"2015-01-01",{"$nulls":3},37,null,{"v":19,"d":"19.0"},null,"2015-01-08",{"$nulls":3},37.5,null,36.2,null,37.1,null,{"v":36.93333333333334,"d":"36.9"},null,"2015-01-15",{"$nulls":3},40.3,null,39.5,null,40.1,null,{"v":39.96666666666667,"d":"40.0"},null,"2015-01-29",{"$nulls":3},42.1,null,40.1,null,41.7,null,{"v":41.300000000000004,"d":"41.3"},null,"Passed",null,null,{"v":4.300000000000004,"d":"4.3"},null,{"$f":"IF(BV12=\"\",\"\",AVERAGE($BV$10:BV12))","v":{"v":40.12222222222223,"d":"40.1"}},null,{"$f":"IF(BV12=\"\",\"\",_xlfn.NORM.DIST(BV12,AVERAGE($BV$10:$BV$5000),Dashboard!$L$36,FALSE))","v":{"v":0.11999139891481325,"d":"0.120"}}]
[{"v":4,"d":"0004"},null,"B1-BM-GB-B1:B10 - 01/01/2015",{"$nulls":10},9,null,"1243, 1244, 1245",{"$nulls":11},"Supplier D",{"$nulls":3},"2015-01-01",{"$nulls":3},37,null,{"v":19,"d":"19.0"},null,"2015-01-08",{"$nulls":3},35.7,null,34.3,null,{"v":35,"d":"35.0"},null,{"v":35,"d":"35.0"},null,"2015-01-15",{"$nulls":3},38.5,null,37.6,null,{"v":38,"d":"38.0"},null,{"v":38.03333333333333,"d":"38.0"},null,"2015-01-29",{"$nulls":3},40.3,null,39.2,null,39.6,null,{"v":39.699999999999996,"d":"39.7"},null,"Passed",null,null,{"v":2.6999999999999957,"d":"2.7"},null,{"$f":"IF(BV13=\"\",\"\",AVERAGE($BV$10:BV13))","v":{"v":40.016666666666666,"d":"40.0"}},null,{"$f":"IF(BV13=\"\",\"\",_xlfn.NORM.DIST(BV13,AVERAGE($BV$10:$BV$5000),Dashboard!$L$36,FALSE))","v":{"v":0.4882994459583222,"d":"0.488"}}]
[{"v":5,"d":"0005"},null,"B2-BM-GB-B1:B10 - 01/01/2015",{"$nulls":10},9,null,"1246, 1247, 1248",{"$nulls":11},"Supplier E",{"$nulls":3},"2015-01-01",{"$nulls":3},37,null,{"v":19,"d":"19.0"},null,"2015-01-08",{"$nulls":3},35.9,null,34.4,null,34.9,null,{"v":35.06666666666666,"d":"35.1"},null,"2015-01-15",{"$nulls":3},38.7,null,37.7,null,37.9,null,38.1,null,"2015-01-29",{"$nulls":3},40.5,null,39.3,null,39.5,null,{"v":39.766666666666666,"d":"39.8"},null,"Passed",null,null,{"v":2.7666666666666657,"d":"2.8"},null,{"$f":"IF(BV14=\"\",\"\",AVERAGE($BV$10:BV14))","v":{"v":39.96666666666666,"d":"40.0"}},null,{"$f":"IF(BV14=\"\",\"\",_xlfn.NORM.DIST(BV14,AVERAGE($BV$10:$BV$5000),Dashboard!$L$36,FALSE))","v":{"v":0.5037690456327283,"d":"0.504"}}]
[{"v":6,"d":"0006"},null,"B3-BM-GB-B1:B10 - 01/01/2015",{"$nulls":10},9,null,"1249, 1250, 1251",{"$nulls":11},"Supplier A",{"$nulls":3},"2015-01-01",{"$nulls":3},37,null,{"v":19,"d":"19.0"},null,"2015-01-08",{"$nulls":3},35.1,null,33.5,null,33.8,null,{"v":34.13333333333333,"d":"34.1"},null,"2015-01-15",{"$nulls":3},37.9,null,36.8,null,36.8,null,{"v":37.166666666666664,"d":"37.2"},null,"2015-01-29",{"$nulls":3},39.7,null,38.4,null,38.4,null,{"v":38.833333333333336,"d":"38.8"},null,"Passed",null,null,{"v":1.8333333333333357,"d":"1.8"},null,{"$f":"IF(BV15=\"\",\"\",AVERAGE($BV$10:BV15))","v":{"v":39.77777777777778,"d":"39.8"}},null,{"$f":"IF(BV15=\"\",\"\",_xlfn.NORM.DIST(BV15,AVERAGE($BV$10:$BV$5000),Dashboard!$L$36,FALSE))","v":{"v":0.16011928838348904,"d":"0.160"}}]
[{"v":7,"d":"0007"},null,"B1-BM-GB-C1:C10 - 02/01/2015",{"$nulls":10},9,null,"1252, 1253, 1254",{"$nulls":11},"Supplier B",{"$nulls":3},"2015-01-02",{"$nulls":3},37,null,{"v":19,"d":"19.0"},null,"2015-01-09",{"$nulls":3},36.3,null,34.6,null,34.7,null,35.2,null,"2015-01-16",{"$nulls":3},39.1,null,37.9,null,37.7,null,{"v":38.233333333333334,"d":"38.2"},null,"2015-01-30",{"$nulls":3},40.9,null,39.5,null,39.3,null,39.9,null,"Passed",null,null,{"v":2.8999999999999986,"d":"2.9"},null,{"$f":"IF(BV16=\"\",\"\",AVERAGE($BV$10:BV16))","v":{"v":39.7952380952381,"d":"39.8"}},null,{"$f":"IF(BV16=\"\",\"\",_xlfn.NORM.DIST(BV16,AVERAGE($BV$10:$BV$5000),Dashboard!$L$36,FALSE))","v":{"v":0.5237970368487677,"d":"0.524"}}]
[{"v":8,"d":"0008"},null,"B2-BM-GB-C1:C10 - 02/01/2015",{"$nulls":10},9,null,"1255, 1256, 1257",{"$nulls":11},"Supplier C",{"$nulls":3},"2015-01-02",{"$nulls":3},37,null,{"v":19,"d":"19.0"},null,"2015-01-09",{"$nulls":3},36.5,null,34.7,null,34.6,null,{"v":35.26666666666667,"d":"35.3"},null,"2015-01-16",{"$nulls":3},39.3,null,{"v":38,"d":"38.0"},null,37.6,null,{"v":38.300000000000004,"d":"38.3"},null,"2015-01-30",{"$nulls":3},41.1,null,39.6,null,39.2,null,{"v":39.96666666666667,"d":"40.0"},null,"Passed",null,null,{"v":2.9666666666666686,"d":"3.0"},null,{"$f":"IF(BV17=\"\",\"\",AVERAGE($BV$10:BV17))","v":{"v":39.81666666666666,"d":"39.8"}},null,{"$f":"IF(BV17=\"\",\"\",_xlfn.NORM.DIST(BV17,AVERAGE($BV$10:$BV$5000),Dashboard!$L$36,FALSE))","v":{"v":0.527897188494054,"d":"0.528"}}]
[{"v":9,"d":"0009"},null,"B3-BM-GB-C1:C10 - 02/01/2015",{"$nulls":10},9,null,"1258, 1259, 1260",{"$nulls":11},"Supplier D",{"$nulls":3},"2015-01-02",{"$nulls":3},37,null,{"v":19,"d":"19.0"},null,"2015-01-09",{"$nulls":3},36.7,null,34.8,null,34.5,null,{"v":35.333333333333336,"d":"35.3"},null,"2015-01-16",{"$nulls":3},39.5,null,38.1,null,37.5,null,{"v":38.36666666666667,"d":"38.4"},null,"2015-01-30",{"$nulls":3},41.3,null,39.7,null,39.1,null,{"$f":"IF(SUM(BP18:BU18)=0,\"\",AVERAGE(BP18:BU18))","v":{"v":40.03333333333333,"d":"40.0"}},null,"Passed",null,null,{"v":3.0333333333333314,"d":"3.0"},null,{"$f":"IF(BV18=\"\",\"\",AVERAGE($BV$10:BV18))","v":{"v":39.840740740740735,"d":"39.8"}},null,{"$f":"IF(BV18=\"\",\"\",_xlfn.NORM.DIST(BV18,AVERAGE($BV$10:$BV$5000),Dashboard!$L$36,FALSE))","v":{"v":0.5278971884940535,"d":"0.528"}}]
[{"v":10,"d":"0010"},null,"B1-BM-SL-A1:C10 - 09/01/2019",{"$nulls":10},9,null,"1261, 1262, 1263",{"$nulls":11},"Supplier E",{"$nulls":3},"2015-01-09",{"$nulls":3},37,null,{"v":27,"d":"27.0"},null,"2015-01-16",{"$nulls":3},38.9,null,36.9,null,36.4,null,37.4,null,"2015-01-23",{"$nulls":3},41.7,null,40.2,null,39.4,null,{"v":40.43333333333334,"d":"40.4"},null,"2015-02-06",{"$nulls":3},43.5,null,41.8,null,{"v":39,"d":"39.0"},null,{"$f":"IF(SUM(BP19:BU19)=0,\"\",AVERAGE(BP19:BU19))","v":{"v":41.43333333333333,"d":"41.4"}},null,"Passed",null,null,{"v":4.43333333333333,"d":"4.4"},null,{"$f":"IF(BV19=\"\",\"\",AVERAGE($BV$10:BV19))","v":{"v":39.99999999999999,"d":"40.0"}},null,{"$f":"IF(BV19=\"\",\"\",_xlfn.NORM.DIST(BV19,AVERAGE($BV$10:$BV$5000),Dashboard!$L$36,FALSE))","v":{"v":0.08715881857731597,"d":"0.087"}}]
[{"$nulls":49},"",{"$nulls":11},{"$f":"IF(SUM(BD20:BI20)=0,\"\",AVERAGE(BD20:BI20))","v":""},{"$nulls":11},{"$f":"IF(SUM(BP20:BU20)=0,\"\",AVERAGE(BP20:BU20))","v":""},{"$nulls":4},"",null,{"$f":"IF(BV20=\"\",\"\",AVERAGE($BV$10:BV20))","v":""},null,{"$f":"IF(BV20=\"\",\"\",_xlfn.NORM.DIST(BV20,AVERAGE($BV$10:$BV$5000),Dashboard!$L$36,FALSE))","v":""},{"$nulls":5},{"$f":"IF(BV20=\"\",\"\",_xlfn.NORM.DIST(BV20,AVERAGE(BV20:BW5010),Dashboard!$L$36,FALSE))","v":""}]
[{"$nulls":49},{"$f":"IF(SUM(AR21:AW21)=0,\"\",AVERAGE(AR21:AW21))","v":""},{"$nulls":11},{"$f":"IF(SUM(BD21:BI21)=0,\"\",AVERAGE(BD21:BI21))","v":""},{"$nulls":11},{"$f":"IF(SUM(BP21:BU21)=0,\"\",AVERAGE(BP21:BU21))","v":""},{"$nulls":4},"",null,{"$f":"IF(BV21=\"\",\"\",AVERAGE($BV$10:BV21))","v":""},null,{"$f":"IF(BV21=\"\",\"\",_xlfn.NORM.DIST(BV21,AVERAGE($BV$10:$BV$5000),Dashboard!$L$36,FALSE))","v":""},{"$nulls":5},{"$f":"IF(BV21=\"\",\"\",_xlfn.NORM.DIST(BV21,AVERAGE(BV21:BW5011),Dashboard!$L$36,FALSE))","v":""}]
[{"$nulls":49},"",{"$nulls":11},"",{"$nulls":11},"",{"$nulls":4},"",null,{"$f":"IF(BV22=\"\",\"\",AVERAGE($BV$10:BV22))","v":""},null,{"$f":"IF(BV22=\"\",\"\",_xlfn.NORM.DIST(BV22,AVERAGE($BV$10:$BV$5000),Dashboard!$L$36,FALSE))","v":""},{"$nulls":5},{"$f":"IF(BV22=\"\",\"\",_xlfn.NORM.DIST(BV22,AVERAGE(BV22:BW5012),Dashboard!$L$36,FALSE))","v":""}]
[{"$nulls":49},"",{"$nulls":11},"",{"$nulls":11},"",{"$nulls":4},"",null,{"$f":"IF(BV23=\"\",\"\",AVERAGE($BV$10:BV23))","v":""},null,{"$f":"IF(BV23=\"\",\"\",_xlfn.NORM.DIST(BV23,AVERAGE($BV$10:$BV$5000),Dashboard!$L$36,FALSE))","v":""},{"$nulls":5},{"$f":"IF(BV23=\"\",\"\",_xlfn.NORM.DIST(BV23,AVERAGE(BV23:BW5013),Dashboard!$L$36,FALSE))","v":""}]
[{"$nulls":49},"",{"$nulls":11},"",{"$nulls":11},"",{"$nulls":4},"",null,{"$f":"IF(BV24=\"\",\"\",AVERAGE($BV$10:BV24))","v":""},null,{"$f":"IF(BV24=\"\",\"\",_xlfn.NORM.DIST(BV24,AVERAGE($BV$10:$BV$5000),Dashboard!$L$36,FALSE))","v":""},{"$nulls":5},{"$f":"IF(BV24=\"\",\"\",_xlfn.NORM.DIST(BV24,AVERAGE(BV24:BW5014),Dashboard!$L$36,FALSE))","v":""}]
[{"$nulls":49},"",{"$nulls":11},"",{"$nulls":11},"",{"$nulls":4},"",null,{"$f":"IF(BV25=\"\",\"\",AVERAGE($BV$10:BV25))","v":""},null,{"$f":"IF(BV25=\"\",\"\",_xlfn.NORM.DIST(BV25,AVERAGE($BV$10:$BV$5000),Dashboard!$L$36,FALSE))","v":""},{"$nulls":5},{"$f":"IF(BV25=\"\",\"\",_xlfn.NORM.DIST(BV25,AVERAGE(BV25:BW5015),Dashboard!$L$36,FALSE))","v":""}]
[{"$nulls":49},"",{"$nulls":11},"",{"$nulls":11},"",{"$nulls":4},"",null,{"$f":"IF(BV26=\"\",\"\",AVERAGE($BV$10:BV26))","v":""},null,{"$f":"IF(BV26=\"\",\"\",_xlfn.NORM.DIST(BV26,AVERAGE($BV$10:$BV$5000),Dashboard!$L$36,FALSE))","v":""},{"$nulls":5},{"$f":"IF(BV26=\"\",\"\",_xlfn.NORM.DIST(BV26,AVERAGE(BV26:BW5016),Dashboard!$L$36,FALSE))","v":""}]
[{"$nulls":49},"",{"$nulls":11},"",{"$nulls":11},"",{"$nulls":4},"",null,{"$f":"IF(BV27=\"\",\"\",AVERAGE($BV$10:BV27))","v":""},null,{"$f":"IF(BV27=\"\",\"\",_xlfn.NORM.DIST(BV27,AVERAGE($BV$10:$BV$5000),Dashboard!$L$36,FALSE))","v":""},{"$nulls":5},{"$f":"IF(BV27=\"\",\"\",_xlfn.NORM.DIST(BV27,AVERAGE(BV27:BW5017),Dashboard!$L$36,FALSE))","v":""}]
[{"$nulls":49},"",{"$nulls":11},"",{"$nulls":11},"",{"$nulls":4},"",null,{"$f":"IF(BV28=\"\",\"\",AVERAGE($BV$10:BV28))","v":""},null,{"$f":"IF(BV28=\"\",\"\",_xlfn.NORM.DIST(BV28,AVERAGE($BV$10:$BV$5000),Dashboard!$L$36,FALSE))","v":""},{"$nulls":5},{"$f":"IF(BV28=\"\",\"\",_xlfn.NORM.DIST(BV28,AVERAGE(BV28:BW5018),Dashboard!$L$36,FALSE))","v":""}]
[{"$nulls":49},"",{"$nulls":11},"",{"$nulls":11},"",{"$nulls":4},"",null,{"$f":"IF(BV29=\"\",\"\",AVERAGE($BV$10:BV29))","v":""},null,{"$f":"IF(BV29=\"\",\"\",_xlfn.NORM.DIST(BV29,AVERAGE($BV$10:$BV$5000),Dashboard!$L$36,FALSE))","v":""},{"$nulls":5},{"$f":"IF(BV29=\"\",\"\",_xlfn.NORM.DIST(BV29,AVERAGE(BV29:BW5019),Dashboard!$L$36,FALSE))","v":""}]
[{"$nulls":49},"",{"$nulls":11},"",{"$nulls":11},"",{"$nulls":4},"",null,{"$f":"IF(BV30=\"\",\"\",AVERAGE($BV$10:BV30))","v":""},null,{"$f":"IF(BV30=\"\",\"\",_xlfn.NORM.DIST(BV30,AVERAGE($BV$10:$BV$5000),Dashboard!$L$36,FALSE))","v":""},{"$nulls":5},{"$f":"IF(BV30=\"\",\"\",_xlfn.NORM.DIST(BV30,AVERAGE(BV30:BW5020),Dashboard!$L$36,FALSE))","v":""}]
[{"$nulls":49},"",{"$nulls":11},"",{"$nulls":11},"",{"$nulls":4},"",null,{"$f":"IF(BV31=\"\",\"\",AVERAGE($BV$10:BV31))","v":""},null,{"$f":"IF(BV31=\"\",\"\",_xlfn.NORM.DIST(BV31,AVERAGE($BV$10:$BV$5000),Dashboard!$L$36,FALSE))","v":""},{"$nulls":5},{"$f":"IF(BV31=\"\",\"\",_xlfn.NORM.DIST(BV31,AVERAGE(BV31:BW5021),Dashboard!$L$36,FALSE))","v":""}]
[{"$nulls":49},"",{"$nulls":11},"",{"$nulls":11},"",{"$nulls":4},"",null,{"$f":"IF(BV32=\"\",\"\",AVERAGE($BV$10:BV32))","v":""},null,{"$f":"IF(BV32=\"\",\"\",_xlfn.NORM.DIST(BV32,AVERAGE($BV$10:$BV$5000),Dashboard!$L$36,FALSE))","v":""},{"$nulls":5},{"$f":"IF(BV32=\"\",\"\",_xlfn.NORM.DIST(BV32,AVERAGE(BV32:BW5022),Dashboard!$L$36,FALSE))","v":""}]
[{"$nulls":49},"",{"$nulls":11},"",{"$nulls":11},"",{"$nulls":4},"",null,{"$f":"IF(BV33=\"\",\"\",AVERAGE($BV$10:BV33))","v":""},null,{"$f":"IF(BV33=\"\",\"\",_xlfn.NORM.DIST(BV33,AVERAGE($BV$10:$BV$5000),Dashboard!$L$36,FALSE))","v":""},{"$nulls":5},{"$f":"IF(BV33=\"\",\"\",_xlfn.NORM.DIST(BV33,AVERAGE(BV33:BW5023),Dashboard!$L$36,FALSE))","v":""}]
[{"$nulls":49},"",{"$nulls":11},"",{"$nulls":11},"",{"$nulls":4},"",null,{"$f":"IF(BV34=\"\",\"\",AVERAGE($BV$10:BV34))","v":""},null,{"$f":"IF(BV34=\"\",\"\",_xlfn.NORM.DIST(BV34,AVERAGE($BV$10:$BV$5000),Dashboard!$L$36,FALSE))","v":""},{"$nulls":5},{"$f":"IF(BV34=\"\",\"\",_xlfn.NORM.DIST(BV34,AVERAGE(BV34:BW5024),Dashboard!$L$36,FALSE))","v":""}]
[{"$nulls":49},"",{"$nulls":11},"",{"$nulls":11},"",{"$nulls":4},"",null,{"$f":"IF(BV35=\"\",\"\",AVERAGE($BV$10:BV35))","v":""},null,{"$f":"IF(BV35=\"\",\"\",_xlfn.NORM.DIST(BV35,AVERAGE($BV$10:$BV$5000),Dashboard!$L$36,FALSE))","v":""},{"$nulls":5},{"$f":"IF(BV35=\"\",\"\",_xlfn.NORM.DIST(BV35,AVERAGE(BV35:BW5025),Dashboard!$L$36,FALSE))","v":""}]
[{"$nulls":49},"",{"$nulls":11},"",{"$nulls":11},"",{"$nulls":4},"",null,{"$f":"IF(BV36=\"\",\"\",AVERAGE($BV$10:BV36))","v":""},null,{"$f":"IF(BV36=\"\",\"\",_xlfn.NORM.DIST(BV36,AVERAGE($BV$10:$BV$5000),Dashboard!$L$36,FALSE))","v":""},{"$nulls":5},{"$f":"IF(BV36=\"\",\"\",_xlfn.NORM.DIST(BV36,AVERAGE(BV36:BW5026),Dashboard!$L$36,FALSE))","v":""}]
[{"$nulls":49},"",{"$nulls":11},"",{"$nulls":11},"",{"$nulls":4},"",null,{"$f":"IF(BV37=\"\",\"\",AVERAGE($BV$10:BV37))","v":""},null,{"$f":"IF(BV37=\"\",\"\",_xlfn.NORM.DIST(BV37,AVERAGE($BV$10:$BV$5000),Dashboard!$L$36,FALSE))","v":""},{"$nulls":5},{"$f":"IF(BV37=\"\",\"\",_xlfn.NORM.DIST(BV37,AVERAGE(BV37:BW5027),Dashboard!$L$36,FALSE))","v":""}]
[{"$nulls":49},"",{"$nulls":11},"",{"$nulls":11},"",{"$nulls":4},"",null,{"$f":"IF(BV38=\"\",\"\",AVERAGE($BV$10:BV38))","v":""},null,{"$f":"IF(BV38=\"\",\"\",_xlfn.NORM.DIST(BV38,AVERAGE($BV$10:$BV$5000),Dashboard!$L$36,FALSE))","v":""},{"$nulls":5},{"$f":"IF(BV38=\"\",\"\",_xlfn.NORM.DIST(BV38,AVERAGE(BV38:BW5028),Dashboard!$L$36,FALSE))","v":""}]
[{"$nulls":49},"",{"$nulls":11},"",{"$nulls":11},"",{"$nulls":4},"",null,{"$f":"IF(BV39=\"\",\"\",AVERAGE($BV$10:BV39))","v":""},null,{"$f":"IF(BV39=\"\",\"\",_xlfn.NORM.DIST(BV39,AVERAGE($BV$10:$BV$5000),Dashboard!$L$36,FALSE))","v":""},{"$nulls":5},{"$f":"IF(BV39=\"\",\"\",_xlfn.NORM.DIST(BV39,AVERAGE(BV39:BW5029),Dashboard!$L$36,FALSE))","v":""}]
[{"$nulls":49},"",{"$nulls":11},"",{"$nulls":11},"",{"$nulls":4},"",null,{"$f":"IF(BV40=\"\",\"\",AVERAGE($BV$10:BV40))","v":""},null,{"$f":"IF(BV40=\"\",\"\",_xlfn.NORM.DIST(BV40,AVERAGE($BV$10:$BV$5000),Dashboard!$L$36,FALSE))","v":""},{"$nulls":5},{"$f":"IF(BV40=\"\",\"\",_xlfn.NORM.DIST(BV40,AVERAGE(BV40:BW5030),Dashboard!$L$36,FALSE))","v":""}]
[{"$nulls":49},"",{"$nulls":11},"",{"$nulls":11},"",{"$nulls":4},"",null,{"$f":"IF(BV41=\"\",\"\",AVERAGE($BV$10:BV41))","v":""},null,{"$f":"IF(BV41=\"\",\"\",_xlfn.NORM.DIST(BV41,AVERAGE($BV$10:$BV$5000),Dashboard!$L$36,FALSE))","v":""},{"$nulls":5},{"$f":"IF(BV41=\"\",\"\",_xlfn.NORM.DIST(BV41,AVERAGE(BV41:BW5031),Dashboard!$L$36,FALSE))","v":""}]
[{"$nulls":49},"",{"$nulls":11},"",{"$nulls":11},"",{"$nulls":4},{"$f":"IF(BV42=\"\",\"\",BV42-AJ42)","v":""},null,{"$f":"IF(BV42=\"\",\"\",AVERAGE($BV$10:BV42))","v":""},null,{"$f":"IF(BV42=\"\",\"\",_xlfn.NORM.DIST(BV42,AVERAGE($BV$10:$BV$5000),Dashboard!$L$36,FALSE))","v":""},{"$nulls":5},{"$f":"IF(BV42=\"\",\"\",_xlfn.NORM.DIST(BV42,AVERAGE(BV42:BW5032),Dashboard!$L$36,FALSE))","v":""}]
[{"$nulls":49},"",{"$nulls":11},"",{"$nulls":11},"",{"$nulls":4},"",null,{"$f":"IF(BV43=\"\",\"\",AVERAGE($BV$10:BV43))","v":""},null,{"$f":"IF(BV43=\"\",\"\",_xlfn.NORM.DIST(BV43,AVERAGE($BV$10:$BV$5000),Dashboard!$L$36,FALSE))","v":""},{"$nulls":5},{"$f":"IF(BV43=\"\",\"\",_xlfn.NORM.DIST(BV43,AVERAGE(BV43:BW5033),Dashboard!$L$36,FALSE))","v":""}]
[{"$nulls":49},"",{"$nulls":11},"",{"$nulls":11},"",{"$nulls":4},"",null,{"$f":"IF(BV44=\"\",\"\",AVERAGE($BV$10:BV44))","v":""},null,{"$f":"IF(BV44=\"\",\"\",_xlfn.NORM.DIST(BV44,AVERAGE($BV$10:$BV$5000),Dashboard!$L$36,FALSE))","v":""},{"$nulls":5},{"$f":"IF(BV44=\"\",\"\",_xlfn.NORM.DIST(BV44,AVERAGE(BV44:BW5034),Dashboard!$L$36,FALSE))","v":""}]
[{"$nulls":49},"",{"$nulls":11},"",{"$nulls":11},"",{"$nulls":4},"",null,{"$f":"IF(BV45=\"\",\"\",AVERAGE($BV$10:BV45))","v":""},null,{"$f":"IF(BV45=\"\",\"\",_xlfn.NORM.DIST(BV45,AVERAGE($BV$10:$BV$5000),Dashboard!$L$36,FALSE))","v":""},{"$nulls":5},{"$f":"IF(BV45=\"\",\"\",_xlfn.NORM.DIST(BV45,AVERAGE(BV45:BW5035),Dashboard!$L$36,FALSE))","v":""}]
[{"$nulls":49},"",{"$nulls":11},"",{"$nulls":11},"",{"$nulls":4},"",null,{"$f":"IF(BV46=\"\",\"\",AVERAGE($BV$10:BV46))","v":""},null,{"$f":"IF(BV46=\"\",\"\",_xlfn.NORM.DIST(BV46,AVERAGE($BV$10:$BV$5000),Dashboard!$L$36,FALSE))","v":""},{"$nulls":5},{"$f":"IF(BV46=\"\",\"\",_xlfn.NORM.DIST(BV46,AVERAGE(BV46:BW5036),Dashboard!$L$36,FALSE))","v":""}]
[{"$nulls":49},"",{"$nulls":11},"",{"$nulls":11},"",{"$nulls":4},"",null,{"$f":"IF(BV47=\"\",\"\",AVERAGE($BV$10:BV47))","v":""},null,{"$f":"IF(BV47=\"\",\"\",_xlfn.NORM.DIST(BV47,AVERAGE($BV$10:$BV$5000),Dashboard!$L$36,FALSE))","v":""},{"$nulls":5},{"$f":"IF(BV47=\"\",\"\",_xlfn.NORM.DIST(BV47,AVERAGE(BV47:BW5037),Dashboard!$L$36,FALSE))","v":""}]
[{"$nulls":49},"",{"$nulls":11},"",{"$nulls":11},"",{"$nulls":4},"",null,{"$f":"IF(BV48=\"\",\"\",AVERAGE($BV$10:BV48))","v":""},null,{"$f":"IF(BV48=\"\",\"\",_xlfn.NORM.DIST(BV48,AVERAGE($BV$10:$BV$5000),Dashboard!$L$36,FALSE))","v":""},{"$nulls":5},{"$f":"IF(BV48=\"\",\"\",_xlfn.NORM.DIST(BV48,AVERAGE(BV48:BW5038),Dashboard!$L$36,FALSE))","v":""}]
[{"$nulls":49},"",{"$nulls":11},"",{"$nulls":11},"",{"$nulls":4},"",null,{"$f":"IF(BV49=\"\",\"\",AVERAGE($BV$10:BV49))","v":""},null,{"$f":"IF(BV49=\"\",\"\",_xlfn.NORM.DIST(BV49,AVERAGE($BV$10:$BV$5000),Dashboard!$L$36,FALSE))","v":""},{"$nulls":5},{"$f":"IF(BV49=\"\",\"\",_xlfn.NORM.DIST(BV49,AVERAGE(BV49:BW5039),Dashboard!$L$36,FALSE))","v":""}]
[{"$nulls":49},"",{"$nulls":11},"",{"$nulls":11},"",{"$nulls":4},"",null,{"$f":"IF(BV50=\"\",\"\",AVERAGE($BV$10:BV50))","v":""},null,{"$f":"IF(BV50=\"\",\"\",_xlfn.NORM.DIST(BV50,AVERAGE($BV$10:$BV$5000),Dashboard!$L$36,FALSE))","v":""},{"$nulls":5},{"$f":"IF(BV50=\"\",\"\",_xlfn.NORM.DIST(BV50,AVERAGE(BV50:BW5040),Dashboard!$L$36,FALSE))","v":""}]
[{"$nulls":49},"",{"$nulls":11},"",{"$nulls":11},"",{"$nulls":4},"",null,{"$f":"IF(BV51=\"\",\"\",AVERAGE($BV$10:BV51))","v":""},null,{"$f":"IF(BV51=\"\",\"\",_xlfn.NORM.DIST(BV51,AVERAGE($BV$10:$BV$5000),Dashboard!$L$36,FALSE))","v":""},{"$nulls":5},{"$f":"IF(BV51=\"\",\"\",_xlfn.NORM.DIST(BV51,AVERAGE(BV51:BW5041),Dashboard!$L$36,FALSE))","v":""}]
[{"$nulls":49},"",{"$nulls":11},"",{"$nulls":11},"",{"$nulls":4},"",null,{"$f":"IF(BV52=\"\",\"\",AVERAGE($BV$10:BV52))","v":""},null,{"$f":"IF(BV52=\"\",\"\",_xlfn.NORM.DIST(BV52,AVERAGE($BV$10:$BV$5000),Dashboard!$L$36,FALSE))","v":""},{"$nulls":5},{"$f":"IF(BV52=\"\",\"\",_xlfn.NORM.DIST(BV52,AVERAGE(BV52:BW5042),Dashboard!$L$36,FALSE))","v":""}]
[{"$nulls":49},"",{"$nulls":11},"",{"$nulls":11},"",{"$nulls":4},"",null,{"$f":"IF(BV53=\"\",\"\",AVERAGE($BV$10:BV53))","v":""},null,{"$f":"IF(BV53=\"\",\"\",_xlfn.NORM.DIST(BV53,AVERAGE($BV$10:$BV$5000),Dashboard!$L$36,FALSE))","v":""},{"$nulls":5},{"$f":"IF(BV53=\"\",\"\",_xlfn.NORM.DIST(BV53,AVERAGE(BV53:BW5043),Dashboard!$L$36,FALSE))","v":""}]
[{"$nulls":49},"",{"$nulls":11},"",{"$nulls":11},"",{"$nulls":4},"",null,{"$f":"IF(BV54=\"\",\"\",AVERAGE($BV$10:BV54))","v":""},null,{"$f":"IF(BV54=\"\",\"\",_xlfn.NORM.DIST(BV54,AVERAGE($BV$10:$BV$5000),Dashboard!$L$36,FALSE))","v":""},{"$nulls":5},{"$f":"IF(BV54=\"\",\"\",_xlfn.NORM.DIST(BV54,AVERAGE(BV54:BW5044),Dashboard!$L$36,FALSE))","v":""}]
[{"$nulls":49},"",{"$nulls":11},"",{"$nulls":11},"",{"$nulls":4},"",null,{"$f":"IF(BV55=\"\",\"\",AVERAGE($BV$10:BV55))","v":""},null,{"$f":"IF(BV55=\"\",\"\",_xlfn.NORM.DIST(BV55,AVERAGE($BV$10:$BV$5000),Dashboard!$L$36,FALSE))","v":""},{"$nulls":5},{"$f":"IF(BV55=\"\",\"\",_xlfn.NORM.DIST(BV55,AVERAGE(BV55:BW5045),Dashboard!$L$36,FALSE))","v":""}]
[{"$nulls":49},"",{"$nulls":11},"",{"$nulls":11},"",{"$nulls":4},"",null,{"$f":"IF(BV56=\"\",\"\",AVERAGE($BV$10:BV56))","v":""},null,{"$f":"IF(BV56=\"\",\"\",_xlfn.NORM.DIST(BV56,AVERAGE($BV$10:$BV$5000),Dashboard!$L$36,FALSE))","v":""},{"$nulls":5},{"$f":"IF(BV56=\"\",\"\",_xlfn.NORM.DIST(BV56,AVERAGE(BV56:BW5046),Dashboard!$L$36,FALSE))","v":""}]
[{"$nulls":49},"",{"$nulls":11},"",{"$nulls":11},"",{"$nulls":4},"",null,{"$f":"IF(BV57=\"\",\"\",AVERAGE($BV$10:BV57))","v":""},null,{"$f":"IF(BV57=\"\",\"\",_xlfn.NORM.DIST(BV57,AVERAGE($BV$10:$BV$5000),Dashboard!$L$36,FALSE))","v":""},{"$nulls":5},{"$f":"IF(BV57=\"\",\"\",_xlfn.NORM.DIST(BV57,AVERAGE(BV57:BW5047),Dashboard!$L$36,FALSE))","v":""}]
[{"$nulls":49},"",{"$nulls":11},"",{"$nulls":11},"",{"$nulls":4},"",null,{"$f":"IF(BV58=\"\",\"\",AVERAGE($BV$10:BV58))","v":""},null,{"$f":"IF(BV58=\"\",\"\",_xlfn.NORM.DIST(BV58,AVERAGE($BV$10:$BV$5000),Dashboard!$L$36,FALSE))","v":""},{"$nulls":5},{"$f":"IF(BV58=\"\",\"\",_xlfn.NORM.DIST(BV58,AVERAGE(BV58:BW5048),Dashboard!$L$36,FALSE))","v":""}]
[{"$nulls":49},"",{"$nulls":11},"",{"$nulls":11},"",{"$nulls":4},"",null,{"$f":"IF(BV59=\"\",\"\",AVERAGE($BV$10:BV59))","v":""},null,{"$f":"IF(BV59=\"\",\"\",_xlfn.NORM.DIST(BV59,AVERAGE($BV$10:$BV$5000),Dashboard!$L$36,FALSE))","v":""},{"$nulls":5},{"$f":"IF(BV59=\"\",\"\",_xlfn.NORM.DIST(BV59,AVERAGE(BV59:BW5049),Dashboard!$L$36,FALSE))","v":""}]
[{"$nulls":49},"",{"$nulls":11},"",{"$nulls":11},"",{"$nulls":4},"",null,{"$f":"IF(BV60=\"\",\"\",AVERAGE($BV$10:BV60))","v":""},null,{"$f":"IF(BV60=\"\",\"\",_xlfn.NORM.DIST(BV60,AVERAGE($BV$10:$BV$5000),Dashboard!$L$36,FALSE))","v":""},{"$nulls":5},{"$f":"IF(BV60=\"\",\"\",_xlfn.NORM.DIST(BV60,AVERAGE(BV60:BW5050),Dashboard!$L$36,FALSE))","v":""}]
[{"$nulls":49},"",{"$nulls":11},"",{"$nulls":11},"",{"$nulls":4},"",null,{"$f":"IF(BV61=\"\",\"\",AVERAGE($BV$10:BV61))","v":""},null,{"$f":"IF(BV61=\"\",\"\",_xlfn.NORM.DIST(BV61,AVERAGE($BV$10:$BV$5000),Dashboard!$L$36,FALSE))","v":""},{"$nulls":5},{"$f":"IF(BV61=\"\",\"\",_xlfn.NORM.DIST(BV61,AVERAGE(BV61:BW5051),Dashboard!$L$36,FALSE))","v":""}]
[{"$nulls":49},"",{"$nulls":11},"",{"$nulls":11},"",{"$nulls":4},"",null,{"$f":"IF(BV62=\"\",\"\",AVERAGE($BV$10:BV62))","v":""},null,{"$f":"IF(BV62=\"\",\"\",_xlfn.NORM.DIST(BV62,AVERAGE($BV$10:$BV$5000),Dashboard!$L$36,FALSE))","v":""},{"$nulls":5},{"$f":"IF(BV62=\"\",\"\",_xlfn.NORM.DIST(BV62,AVERAGE(BV62:BW5052),Dashboard!$L$36,FALSE))","v":""}]
[{"$nulls":49},"",{"$nulls":11},"",{"$nulls":11},"",{"$nulls":4},"",null,{"$f":"IF(BV63=\"\",\"\",AVERAGE($BV$10:BV63))","v":""},null,{"$f":"IF(BV63=\"\",\"\",_xlfn.NORM.DIST(BV63,AVERAGE($BV$10:$BV$5000),Dashboard!$L$36,FALSE))","v":""},{"$nulls":5},{"$f":"IF(BV63=\"\",\"\",_xlfn.NORM.DIST(BV63,AVERAGE(BV63:BW5053),Dashboard!$L$36,FALSE))","v":""}]
[{"$nulls":49},"",{"$nulls":11},"",{"$nulls":11},"",{"$nulls":4},"",null,{"$f":"IF(BV64=\"\",\"\",AVERAGE($BV$10:BV64))","v":""},null,{"$f":"IF(BV64=\"\",\"\",_xlfn.NORM.DIST(BV64,AVERAGE($BV$10:$BV$5000),Dashboard!$L$36,FALSE))","v":""},{"$nulls":5},{"$f":"IF(BV64=\"\",\"\",_xlfn.NORM.DIST(BV64,AVERAGE(BV64:BW5054),Dashboard!$L$36,FALSE))","v":""}]
[{"$nulls":49},"",{"$nulls":11},"",{"$nulls":11},"",{"$nulls":4},"",null,{"$f":"IF(BV65=\"\",\"\",AVERAGE($BV$10:BV65))","v":""},null,{"$f":"IF(BV65=\"\",\"\",_xlfn.NORM.DIST(BV65,AVERAGE($BV$10:$BV$5000),Dashboard!$L$36,FALSE))","v":""},{"$nulls":5},{"$f":"IF(BV65=\"\",\"\",_xlfn.NORM.DIST(BV65,AVERAGE(BV65:BW5055),Dashboard!$L$36,FALSE))","v":""}]
[{"$nulls":49},"",{"$nulls":11},"",{"$nulls":11},"",{"$nulls":4},"",null,{"$f":"IF(BV66=\"\",\"\",AVERAGE($BV$10:BV66))","v":""},null,{"$f":"IF(BV66=\"\",\"\",_xlfn.NORM.DIST(BV66,AVERAGE($BV$10:$BV$5000),Dashboard!$L$36,FALSE))","v":""},{"$nulls":5},{"$f":"IF(BV66=\"\",\"\",_xlfn.NORM.DIST(BV66,AVERAGE(BV66:BW5056),Dashboard!$L$36,FALSE))","v":""}]
[{"$nulls":49},"",{"$nulls":11},"",{"$nulls":11},"",{"$nulls":4},"",null,{"$f":"IF(BV67=\"\",\"\",AVERAGE($BV$10:BV67))","v":""},null,{"$f":"IF(BV67=\"\",\"\",_xlfn.NORM.DIST(BV67,AVERAGE($BV$10:$BV$5000),Dashboard!$L$36,FALSE))","v":""},{"$nulls":5},{"$f":"IF(BV67=\"\",\"\",_xlfn.NORM.DIST(BV67,AVERAGE(BV67:BW5057),Dashboard!$L$36,FALSE))","v":""}]
[{"$nulls":49},"",{"$nulls":11},"",{"$nulls":11},"",{"$nulls":4},"",null,{"$f":"IF(BV68=\"\",\"\",AVERAGE($BV$10:BV68))","v":""},null,{"$f":"IF(BV68=\"\",\"\",_xlfn.NORM.DIST(BV68,AVERAGE($BV$10:$BV$5000),Dashboard!$L$36,FALSE))","v":""},{"$nulls":5},{"$f":"IF(BV68=\"\",\"\",_xlfn.NORM.DIST(BV68,AVERAGE(BV68:BW5058),Dashboard!$L$36,FALSE))","v":""}]
[{"$nulls":49},"",{"$nulls":11},"",{"$nulls":11},"",{"$nulls":4},"",null,{"$f":"IF(BV69=\"\",\"\",AVERAGE($BV$10:BV69))","v":""},null,{"$f":"IF(BV69=\"\",\"\",_xlfn.NORM.DIST(BV69,AVERAGE($BV$10:$BV$5000),Dashboard!$L$36,FALSE))","v":""},{"$nulls":5},{"$f":"IF(BV69=\"\",\"\",_xlfn.NORM.DIST(BV69,AVERAGE(BV69:BW5059),Dashboard!$L$36,FALSE))","v":""}]
[{"$nulls":49},"",{"$nulls":11},"",{"$nulls":11},"",{"$nulls":4},"",null,{"$f":"IF(BV70=\"\",\"\",AVERAGE($BV$10:BV70))","v":""},null,{"$f":"IF(BV70=\"\",\"\",_xlfn.NORM.DIST(BV70,AVERAGE($BV$10:$BV$5000),Dashboard!$L$36,FALSE))","v":""},{"$nulls":5},{"$f":"IF(BV70=\"\",\"\",_xlfn.NORM.DIST(BV70,AVERAGE(BV70:BW5060),Dashboard!$L$36,FALSE))","v":""}]
[{"$nulls":49},"",{"$nulls":11},"",{"$nulls":11},"",{"$nulls":4},"",null,{"$f":"IF(BV71=\"\",\"\",AVERAGE($BV$10:BV71))","v":""},null,{"$f":"IF(BV71=\"\",\"\",_xlfn.NORM.DIST(BV71,AVERAGE($BV$10:$BV$5000),Dashboard!$L$36,FALSE))","v":""},{"$nulls":5},{"$f":"IF(BV71=\"\",\"\",_xlfn.NORM.DIST(BV71,AVERAGE(BV71:BW5061),Dashboard!$L$36,FALSE))","v":""}]
[{"$nulls":49},"",{"$nulls":11},"",{"$nulls":11},"",{"$nulls":4},"",null,{"$f":"IF(BV72=\"\",\"\",AVERAGE($BV$10:BV72))","v":""},null,{"$f":"IF(BV72=\"\",\"\",_xlfn.NORM.DIST(BV72,AVERAGE($BV$10:$BV$5000),Dashboard!$L$36,FALSE))","v":""},{"$nulls":5},{"$f":"IF(BV72=\"\",\"\",_xlfn.NORM.DIST(BV72,AVERAGE(BV72:BW5062),Dashboard!$L$36,FALSE))","v":""}]
[{"$nulls":49},"",{"$nulls":11},"",{"$nulls":11},"",{"$nulls":4},"",null,{"$f":"IF(BV73=\"\",\"\",AVERAGE($BV$10:BV73))","v":""},null,{"$f":"IF(BV73=\"\",\"\",_xlfn.NORM.DIST(BV73,AVERAGE($BV$10:$BV$5000),Dashboard!$L$36,FALSE))","v":""},{"$nulls":5},{"$f":"IF(BV73=\"\",\"\",_xlfn.NORM.DIST(BV73,AVERAGE(BV73:BW5063),Dashboard!$L$36,FALSE))","v":""}]
[{"$nulls":49},"",{"$nulls":11},"",{"$nulls":11},"",{"$nulls":4},{"$f":"IF(BV74=\"\",\"\",BV74-AJ74)","v":""},null,{"$f":"IF(BV74=\"\",\"\",AVERAGE($BV$10:BV74))","v":""},null,{"$f":"IF(BV74=\"\",\"\",_xlfn.NORM.DIST(BV74,AVERAGE($BV$10:$BV$5000),Dashboard!$L$36,FALSE))","v":""},{"$nulls":5},{"$f":"IF(BV74=\"\",\"\",_xlfn.NORM.DIST(BV74,AVERAGE(BV74:BW5064),Dashboard!$L$36,FALSE))","v":""}]
[{"$nulls":49},"",{"$nulls":11},"",{"$nulls":11},"",{"$nulls":4},"",null,{"$f":"IF(BV75=\"\",\"\",AVERAGE($BV$10:BV75))","v":""},null,{"$f":"IF(BV75=\"\",\"\",_xlfn.NORM.DIST(BV75,AVERAGE($BV$10:$BV$5000),Dashboard!$L$36,FALSE))","v":""},{"$nulls":5},{"$f":"IF(BV75=\"\",\"\",_xlfn.NORM.DIST(BV75,AVERAGE(BV75:BW5065),Dashboard!$L$36,FALSE))","v":""}]
[{"$nulls":49},"",{"$nulls":11},"",{"$nulls":11},"",{"$nulls":4},"",null,{"$f":"IF(BV76=\"\",\"\",AVERAGE($BV$10:BV76))","v":""},null,{"$f":"IF(BV76=\"\",\"\",_xlfn.NORM.DIST(BV76,AVERAGE($BV$10:$BV$5000),Dashboard!$L$36,FALSE))","v":""},{"$nulls":5},{"$f":"IF(BV76=\"\",\"\",_xlfn.NORM.DIST(BV76,AVERAGE(BV76:BW5066),Dashboard!$L$36,FALSE))","v":""}]
[{"$nulls":49},"",{"$nulls":11},"",{"$nulls":11},"",{"$nulls":4},"",null,{"$f":"IF(BV77=\"\",\"\",AVERAGE($BV$10:BV77))","v":""},null,{"$f":"IF(BV77=\"\",\"\",_xlfn.NORM.DIST(BV77,AVERAGE($BV$10:$BV$5000),Dashboard!$L$36,FALSE))","v":""},{"$nulls":5},{"$f":"IF(BV77=\"\",\"\",_xlfn.NORM.DIST(BV77,AVERAGE(BV77:BW5067),Dashboard!$L$36,FALSE))","v":""}]
[{"$nulls":49},"",{"$nulls":11},"",{"$nulls":11},"",{"$nulls":4},"",null,{"$f":"IF(BV78=\"\",\"\",AVERAGE($BV$10:BV78))","v":""},null,{"$f":"IF(BV78=\"\",\"\",_xlfn.NORM.DIST(BV78,AVERAGE($BV$10:$BV$5000),Dashboard!$L$36,FALSE))","v":""},{"$nulls":5},{"$f":"IF(BV78=\"\",\"\",_xlfn.NORM.DIST(BV78,AVERAGE(BV78:BW5068),Dashboard!$L$36,FALSE))","v":""}]
[{"$nulls":49},"",{"$nulls":11},"",{"$nulls":11},"",{"$nulls":4},"",null,{"$f":"IF(BV79=\"\",\"\",AVERAGE($BV$10:BV79))","v":""},null,{"$f":"IF(BV79=\"\",\"\",_xlfn.NORM.DIST(BV79,AVERAGE($BV$10:$BV$5000),Dashboard!$L$36,FALSE))","v":""},{"$nulls":5},{"$f":"IF(BV79=\"\",\"\",_xlfn.NORM.DIST(BV79,AVERAGE(BV79:BW5069),Dashboard!$L$36,FALSE))","v":""}]
[{"$nulls":49},"",{"$nulls":11},"",{"$nulls":11},"",{"$nulls":4},"",null,{"$f":"IF(BV80=\"\",\"\",AVERAGE($BV$10:BV80))","v":""},null,{"$f":"IF(BV80=\"\",\"\",_xlfn.NORM.DIST(BV80,AVERAGE($BV$10:$BV$5000),Dashboard!$L$36,FALSE))","v":""},{"$nulls":5},{"$f":"IF(BV80=\"\",\"\",_xlfn.NORM.DIST(BV80,AVERAGE(BV80:BW5070),Dashboard!$L$36,FALSE))","v":""}]
[{"$nulls":49},"",{"$nulls":11},"",{"$nulls":11},"",{"$nulls":4},"",null,{"$f":"IF(BV81=\"\",\"\",AVERAGE($BV$10:BV81))","v":""},null,{"$f":"IF(BV81=\"\",\"\",_xlfn.NORM.DIST(BV81,AVERAGE($BV$10:$BV$5000),Dashboard!$L$36,FALSE))","v":""},{"$nulls":5},{"$f":"IF(BV81=\"\",\"\",_xlfn.NORM.DIST(BV81,AVERAGE(BV81:BW5071),Dashboard!$L$36,FALSE))","v":""}]
[{"$nulls":49},"",{"$nulls":11},"",{"$nulls":11},"",{"$nulls":4},"",null,{"$f":"IF(BV82=\"\",\"\",AVERAGE($BV$10:BV82))","v":""},null,{"$f":"IF(BV82=\"\",\"\",_xlfn.NORM.DIST(BV82,AVERAGE($BV$10:$BV$5000),Dashboard!$L$36,FALSE))","v":""},{"$nulls":5},{"$f":"IF(BV82=\"\",\"\",_xlfn.NORM.DIST(BV82,AVERAGE(BV82:BW5072),Dashboard!$L$36,FALSE))","v":""}]
[{"$nulls":49},"",{"$nulls":11},"",{"$nulls":11},"",{"$nulls":4},"",null,{"$f":"IF(BV83=\"\",\"\",AVERAGE($BV$10:BV83))","v":""},null,{"$f":"IF(BV83=\"\",\"\",_xlfn.NORM.DIST(BV83,AVERAGE($BV$10:$BV$5000),Dashboard!$L$36,FALSE))","v":""},{"$nulls":5},{"$f":"IF(BV83=\"\",\"\",_xlfn.NORM.DIST(BV83,AVERAGE(BV83:BW5073),Dashboard!$L$36,FALSE))","v":""}]
[{"$nulls":49},"",{"$nulls":11},"",{"$nulls":11},"",{"$nulls":4},"",null,{"$f":"IF(BV84=\"\",\"\",AVERAGE($BV$10:BV84))","v":""},null,{"$f":"IF(BV84=\"\",\"\",_xlfn.NORM.DIST(BV84,AVERAGE($BV$10:$BV$5000),Dashboard!$L$36,FALSE))","v":""},{"$nulls":5},{"$f":"IF(BV84=\"\",\"\",_xlfn.NORM.DIST(BV84,AVERAGE(BV84:BW5074),Dashboard!$L$36,FALSE))","v":""}]
[{"$nulls":49},{"$f":"IF(SUM(AR85:AW85)=0,\"\",AVERAGE(AR85:AW85))","v":""},{"$nulls":11},{"$f":"IF(SUM(BD85:BI85)=0,\"\",AVERAGE(BD85:BI85))","v":""},{"$nulls":11},{"$f":"IF(SUM(BP85:BU85)=0,\"\",AVERAGE(BP85:BU85))","v":""},{"$nulls":4},{"$f":"IF(BV85=\"\",\"\",BV85-AJ85)","v":""},null,{"$f":"IF(BV85=\"\",\"\",AVERAGE($BV$10:BV85))","v":""},null,{"$f":"IF(BV85=\"\",\"\",_xlfn.NORM.DIST(BV85,AVERAGE($BV$10:$BV$5000),Dashboard!$L$36,FALSE))","v":""},{"$nulls":5},{"$f":"IF(BV85=\"\",\"\",_xlfn.NORM.DIST(BV85,AVERAGE(BV85:BW5075),Dashboard!$L$36,FALSE))","v":""}]
[{"$nulls":49},"",{"$nulls":11},"",{"$nulls":11},"",{"$nulls":4},"",null,{"$f":"IF(BV86=\"\",\"\",AVERAGE($BV$10:BV86))","v":""},null,{"$f":"IF(BV86=\"\",\"\",_xlfn.NORM.DIST(BV86,AVERAGE($BV$10:$BV$5000),Dashboard!$L$36,FALSE))","v":""},{"$nulls":5},{"$f":"IF(BV86=\"\",\"\",_xlfn.NORM.DIST(BV86,AVERAGE(BV86:BW5076),Dashboard!$L$36,FALSE))","v":""}]
[{"$nulls":49},"",{"$nulls":11},"",{"$nulls":11},"",{"$nulls":4},"",null,{"$f":"IF(BV87=\"\",\"\",AVERAGE($BV$10:BV87))","v":""},null,{"$f":"IF(BV87=\"\",\"\",_xlfn.NORM.DIST(BV87,AVERAGE($BV$10:$BV$5000),Dashboard!$L$36,FALSE))","v":""},{"$nulls":5},{"$f":"IF(BV87=\"\",\"\",_xlfn.NORM.DIST(BV87,AVERAGE(BV87:BW5077),Dashboard!$L$36,FALSE))","v":""}]
[{"$nulls":49},"",{"$nulls":11},"",{"$nulls":11},"",{"$nulls":4},"",null,{"$f":"IF(BV88=\"\",\"\",AVERAGE($BV$10:BV88))","v":""},null,{"$f":"IF(BV88=\"\",\"\",_xlfn.NORM.DIST(BV88,AVERAGE($BV$10:$BV$5000),Dashboard!$L$36,FALSE))","v":""},{"$nulls":5},{"$f":"IF(BV88=\"\",\"\",_xlfn.NORM.DIST(BV88,AVERAGE(BV88:BW5078),Dashboard!$L$36,FALSE))","v":""}]
[{"$nulls":49},"",{"$nulls":11},"",{"$nulls":11},"",{"$nulls":4},"",null,{"$f":"IF(BV89=\"\",\"\",AVERAGE($BV$10:BV89))","v":""},null,{"$f":"IF(BV89=\"\",\"\",_xlfn.NORM.DIST(BV89,AVERAGE($BV$10:$BV$5000),Dashboard!$L$36,FALSE))","v":""},{"$nulls":5},{"$f":"IF(BV89=\"\",\"\",_xlfn.NORM.DIST(BV89,AVERAGE(BV89:BW5079),Dashboard!$L$36,FALSE))","v":""}]
[{"$nulls":49},"",{"$nulls":11},"",{"$nulls":11},"",{"$nulls":4},"",null,{"$f":"IF(BV90=\"\",\"\",AVERAGE($BV$10:BV90))","v":""},null,{"$f":"IF(BV90=\"\",\"\",_xlfn.NORM.DIST(BV90,AVERAGE($BV$10:$BV$5000),Dashboard!$L$36,FALSE))","v":""},{"$nulls":5},{"$f":"IF(BV90=\"\",\"\",_xlfn.NORM.DIST(BV90,AVERAGE(BV90:BW5080),Dashboard!$L$36,FALSE))","v":""}]
[{"$nulls":49},"",{"$nulls":11},"",{"$nulls":11},"",{"$nulls":4},"",null,{"$f":"IF(BV91=\"\",\"\",AVERAGE($BV$10:BV91))","v":""},null,{"$f":"IF(BV91=\"\",\"\",_xlfn.NORM.DIST(BV91,AVERAGE($BV$10:$BV$5000),Dashboard!$L$36,FALSE))","v":""},{"$nulls":5},{"$f":"IF(BV91=\"\",\"\",_xlfn.NORM.DIST(BV91,AVERAGE(BV91:BW5081),Dashboard!$L$36,FALSE))","v":""}]
[{"$nulls":49},"",{"$nulls":11},"",{"$nulls":11},"",{"$nulls":4},"",null,{"$f":"IF(BV92=\"\",\"\",AVERAGE($BV$10:BV92))","v":""},null,{"$f":"IF(BV92=\"\",\"\",_xlfn.NORM.DIST(BV92,AVERAGE($BV$10:$BV$5000),Dashboard!$L$36,FALSE))","v":""},{"$nulls":5},{"$f":"IF(BV92=\"\",\"\",_xlfn.NORM.DIST(BV92,AVERAGE(BV92:BW5082),Dashboard!$L$36,FALSE))","v":""}]
[{"$nulls":49},"",{"$nulls":11},"",{"$nulls":11},"",{"$nulls":4},"",null,{"$f":"IF(BV93=\"\",\"\",AVERAGE($BV$10:BV93))","v":""},null,{"$f":"IF(BV93=\"\",\"\",_xlfn.NORM.DIST(BV93,AVERAGE($BV$10:$BV$5000),Dashboard!$L$36,FALSE))","v":""},{"$nulls":5},{"$f":"IF(BV93=\"\",\"\",_xlfn.NORM.DIST(BV93,AVERAGE(BV93:BW5083),Dashboard!$L$36,FALSE))","v":""}]
[{"$nulls":49},"",{"$nulls":11},"",{"$nulls":11},"",{"$nulls":4},"",null,{"$f":"IF(BV94=\"\",\"\",AVERAGE($BV$10:BV94))","v":""},null,{"$f":"IF(BV94=\"\",\"\",_xlfn.NORM.DIST(BV94,AVERAGE($BV$10:$BV$5000),Dashboard!$L$36,FALSE))","v":""},{"$nulls":5},{"$f":"IF(BV94=\"\",\"\",_xlfn.NORM.DIST(BV94,AVERAGE(BV94:BW5084),Dashboard!$L$36,FALSE))","v":""}]
[{"$nulls":49},"",{"$nulls":11},"",{"$nulls":11},"",{"$nulls":4},"",null,{"$f":"IF(BV95=\"\",\"\",AVERAGE($BV$10:BV95))","v":""},null,{"$f":"IF(BV95=\"\",\"\",_xlfn.NORM.DIST(BV95,AVERAGE($BV$10:$BV$5000),Dashboard!$L$36,FALSE))","v":""},{"$nulls":5},{"$f":"IF(BV95=\"\",\"\",_xlfn.NORM.DIST(BV95,AVERAGE(BV95:BW5085),Dashboard!$L$36,FALSE))","v":""}]
[{"$nulls":49},"",{"$nulls":11},"",{"$nulls":11},"",{"$nulls":4},"",null,{"$f":"IF(BV96=\"\",\"\",AVERAGE($BV$10:BV96))","v":""},null,{"$f":"IF(BV96=\"\",\"\",_xlfn.NORM.DIST(BV96,AVERAGE($BV$10:$BV$5000),Dashboard!$L$36,FALSE))","v":""},{"$nulls":5},{"$f":"IF(BV96=\"\",\"\",_xlfn.NORM.DIST(BV96,AVERAGE(BV96:BW5086),Dashboard!$L$36,FALSE))","v":""}]
[{"$nulls":49},"",{"$nulls":11},"",{"$nulls":11},"",{"$nulls":4},"",null,{"$f":"IF(BV97=\"\",\"\",AVERAGE($BV$10:BV97))","v":""},null,{"$f":"IF(BV97=\"\",\"\",_xlfn.NORM.DIST(BV97,AVERAGE($BV$10:$BV$5000),Dashboard!$L$36,FALSE))","v":""},{"$nulls":5},{"$f":"IF(BV97=\"\",\"\",_xlfn.NORM.DIST(BV97,AVERAGE(BV97:BW5087),Dashboard!$L$36,FALSE))","v":""}]
[{"$nulls":49},"",{"$nulls":11},"",{"$nulls":11},"",{"$nulls":4},"",null,{"$f":"IF(BV98=\"\",\"\",AVERAGE($BV$10:BV98))","v":""},null,{"$f":"IF(BV98=\"\",\"\",_xlfn.NORM.DIST(BV98,AVERAGE($BV$10:$BV$5000),Dashboard!$L$36,FALSE))","v":""},{"$nulls":5},{"$f":"IF(BV98=\"\",\"\",_xlfn.NORM.DIST(BV98,AVERAGE(BV98:BW5088),Dashboard!$L$36,FALSE))","v":""}]
[{"$nulls":49},"",{"$nulls":11},"",{"$nulls":11},"",{"$nulls":4},"",null,{"$f":"IF(BV99=\"\",\"\",AVERAGE($BV$10:BV99))","v":""},null,{"$f":"IF(BV99=\"\",\"\",_xlfn.NORM.DIST(BV99,AVERAGE($BV$10:$BV$5000),Dashboard!$L$36,FALSE))","v":""},{"$nulls":5},{"$f":"IF(BV99=\"\",\"\",_xlfn.NORM.DIST(BV99,AVERAGE(BV99:BW5089),Dashboard!$L$36,FALSE))","v":""}]
[{"$nulls":49},"",{"$nulls":11},"",{"$nulls":11},"",{"$nulls":4},"",null,{"$f":"IF(BV100=\"\",\"\",AVERAGE($BV$10:BV100))","v":""},null,{"$f":"IF(BV100=\"\",\"\",_xlfn.NORM.DIST(BV100,AVERAGE($BV$10:$BV$5000),Dashboard!$L$36,FALSE))","v":""},{"$nulls":5},{"$f":"IF(BV100=\"\",\"\",_xlfn.NORM.DIST(BV100,AVERAGE(BV100:BW5090),Dashboard!$L$36,FALSE))","v":""}]
[{"$nulls":49},"",{"$nulls":11},"",{"$nulls":11},"",{"$nulls":4},"",null,{"$f":"IF(BV101=\"\",\"\",AVERAGE($BV$10:BV101))","v":""},null,{"$f":"IF(BV101=\"\",\"\",_xlfn.NORM.DIST(BV101,AVERAGE($BV$10:$BV$5000),Dashboard!$L$36,FALSE))","v":""},{"$nulls":5},{"$f":"IF(BV101=\"\",\"\",_xlfn.NORM.DIST(BV101,AVERAGE(BV101:BW5091),Dashboard!$L$36,FALSE))","v":""}]
[{"$nulls":49},"",{"$nulls":11},"",{"$nulls":11},"",{"$nulls":4},"",null,{"$f":"IF(BV102=\"\",\"\",AVERAGE($BV$10:BV102))","v":""},null,{"$f":"IF(BV102=\"\",\"\",_xlfn.NORM.DIST(BV102,AVERAGE($BV$10:$BV$5000),Dashboard!$L$36,FALSE))","v":""},{"$nulls":5},{"$f":"IF(BV102=\"\",\"\",_xlfn.NORM.DIST(BV102,AVERAGE(BV102:BW5092),Dashboard!$L$36,FALSE))","v":""}]
[{"$nulls":49},"",{"$nulls":11},"",{"$nulls":11},"",{"$nulls":4},"",null,{"$f":"IF(BV103=\"\",\"\",AVERAGE($BV$10:BV103))","v":""},null,{"$f":"IF(BV103=\"\",\"\",_xlfn.NORM.DIST(BV103,AVERAGE($BV$10:$BV$5000),Dashboard!$L$36,FALSE))","v":""},{"$nulls":5},{"$f":"IF(BV103=\"\",\"\",_xlfn.NORM.DIST(BV103,AVERAGE(BV103:BW5093),Dashboard!$L$36,FALSE))","v":""}]
[{"$nulls":49},"",{"$nulls":11},"",{"$nulls":11},"",{"$nulls":4},"",null,{"$f":"IF(BV104=\"\",\"\",AVERAGE($BV$10:BV104))","v":""},null,{"$f":"IF(BV104=\"\",\"\",_xlfn.NORM.DIST(BV104,AVERAGE($BV$10:$BV$5000),Dashboard!$L$36,FALSE))","v":""},{"$nulls":5},{"$f":"IF(BV104=\"\",\"\",_xlfn.NORM.DIST(BV104,AVERAGE(BV104:BW5094),Dashboard!$L$36,FALSE))","v":""}]
[{"$nulls":49},"",{"$nulls":11},"",{"$nulls":11},"",{"$nulls":4},"",null,{"$f":"IF(BV105=\"\",\"\",AVERAGE($BV$10:BV105))","v":""},null,{"$f":"IF(BV105=\"\",\"\",_xlfn.NORM.DIST(BV105,AVERAGE($BV$10:$BV$5000),Dashboard!$L$36,FALSE))","v":""},{"$nulls":5},{"$f":"IF(BV105=\"\",\"\",_xlfn.NORM.DIST(BV105,AVERAGE(BV105:BW5095),Dashboard!$L$36,FALSE))","v":""}]
[{"$nulls":49},"",{"$nulls":11},"",{"$nulls":11},"",{"$nulls":4},"",null,{"$f":"IF(BV106=\"\",\"\",AVERAGE($BV$10:BV106))","v":""},null,{"$f":"IF(BV106=\"\",\"\",_xlfn.NORM.DIST(BV106,AVERAGE($BV$10:$BV$5000),Dashboard!$L$36,FALSE))","v":""},{"$nulls":5},{"$f":"IF(BV106=\"\",\"\",_xlfn.NORM.DIST(BV106,AVERAGE(BV106:BW5096),Dashboard!$L$36,FALSE))","v":""}]
[{"$nulls":49},"",{"$nulls":11},"",{"$nulls":11},"",{"$nulls":4},"",null,{"$f":"IF(BV107=\"\",\"\",AVERAGE($BV$10:BV107))","v":""},null,{"$f":"IF(BV107=\"\",\"\",_xlfn.NORM.DIST(BV107,AVERAGE($BV$10:$BV$5000),Dashboard!$L$36,FALSE))","v":""},{"$nulls":5},{"$f":"IF(BV107=\"\",\"\",_xlfn.NORM.DIST(BV107,AVERAGE(BV107:BW5097),Dashboard!$L$36,FALSE))","v":""}]
[{"$nulls":49},"",{"$nulls":11},"",{"$nulls":11},"",{"$nulls":4},"",null,{"$f":"IF(BV108=\"\",\"\",AVERAGE($BV$10:BV108))","v":""},null,{"$f":"IF(BV108=\"\",\"\",_xlfn.NORM.DIST(BV108,AVERAGE($BV$10:$BV$5000),Dashboard!$L$36,FALSE))","v":""},{"$nulls":5},{"$f":"IF(BV108=\"\",\"\",_xlfn.NORM.DIST(BV108,AVERAGE(BV108:BW5098),Dashboard!$L$36,FALSE))","v":""}]
[{"$nulls":49},"",{"$nulls":11},"",{"$nulls":11},"",{"$nulls":4},"",null,{"$f":"IF(BV109=\"\",\"\",AVERAGE($BV$10:BV109))","v":""},null,{"$f":"IF(BV109=\"\",\"\",_xlfn.NORM.DIST(BV109,AVERAGE($BV$10:$BV$5000),Dashboard!$L$36,FALSE))","v":""},{"$nulls":5},{"$f":"IF(BV109=\"\",\"\",_xlfn.NORM.DIST(BV109,AVERAGE(BV109:BW5099),Dashboard!$L$36,FALSE))","v":""}]
[{"$nulls":49},"",{"$nulls":11},"",{"$nulls":11},"",{"$nulls":4},"",null,{"$f":"IF(BV110=\"\",\"\",AVERAGE($BV$10:BV110))","v":""},null,{"$f":"IF(BV110=\"\",\"\",_xlfn.NORM.DIST(BV110,AVERAGE($BV$10:$BV$5000),Dashboard!$L$36,FALSE))","v":""},{"$nulls":5},{"$f":"IF(BV110=\"\",\"\",_xlfn.NORM.DIST(BV110,AVERAGE(BV110:BW5100),Dashboard!$L$36,FALSE))","v":""}]
[{"$nulls":49},"",{"$nulls":11},"",{"$nulls":11},"",{"$nulls":4},"",null,{"$f":"IF(BV111=\"\",\"\",AVERAGE($BV$10:BV111))","v":""},null,{"$f":"IF(BV111=\"\",\"\",_xlfn.NORM.DIST(BV111,AVERAGE($BV$10:$BV$5000),Dashboard!$L$36,FALSE))","v":""},{"$nulls":5},{"$f":"IF(BV111=\"\",\"\",_xlfn.NORM.DIST(BV111,AVERAGE(BV111:BW5101),Dashboard!$L$36,FALSE))","v":""}]
[{"$nulls":49},"",{"$nulls":11},"",{"$nulls":11},"",{"$nulls":4},"",null,{"$f":"IF(BV112=\"\",\"\",AVERAGE($BV$10:BV112))","v":""},null,{"$f":"IF(BV112=\"\",\"\",_xlfn.NORM.DIST(BV112,AVERAGE($BV$10:$BV$5000),Dashboard!$L$36,FALSE))","v":""},{"$nulls":5},{"$f":"IF(BV112=\"\",\"\",_xlfn.NORM.DIST(BV112,AVERAGE(BV112:BW5102),Dashboard!$L$36,FALSE))","v":""}]
[{"$nulls":49},"",{"$nulls":11},"",{"$nulls":11},"",{"$nulls":4},"",null,{"$f":"IF(BV113=\"\",\"\",AVERAGE($BV$10:BV113))","v":""},null,{"$f":"IF(BV113=\"\",\"\",_xlfn.NORM.DIST(BV113,AVERAGE($BV$10:$BV$5000),Dashboard!$L$36,FALSE))","v":""},{"$nulls":5},{"$f":"IF(BV113=\"\",\"\",_xlfn.NORM.DIST(BV113,AVERAGE(BV113:BW5103),Dashboard!$L$36,FALSE))","v":""}]
[{"$nulls":49},"",{"$nulls":11},"",{"$nulls":11},"",{"$nulls":4},"",null,{"$f":"IF(BV114=\"\",\"\",AVERAGE($BV$10:BV114))","v":""},null,{"$f":"IF(BV114=\"\",\"\",_xlfn.NORM.DIST(BV114,AVERAGE($BV$10:$BV$5000),Dashboard!$L$36,FALSE))","v":""},{"$nulls":5},{"$f":"IF(BV114=\"\",\"\",_xlfn.NORM.DIST(BV114,AVERAGE(BV114:BW5104),Dashboard!$L$36,FALSE))","v":""}]
[{"$nulls":49},"",{"$nulls":11},"",{"$nulls":11},"",{"$nulls":4},"",null,{"$f":"IF(BV115=\"\",\"\",AVERAGE($BV$10:BV115))","v":""},null,{"$f":"IF(BV115=\"\",\"\",_xlfn.NORM.DIST(BV115,AVERAGE($BV$10:$BV$5000),Dashboard!$L$36,FALSE))","v":""},{"$nulls":5},{"$f":"IF(BV115=\"\",\"\",_xlfn.NORM.DIST(BV115,AVERAGE(BV115:BW5105),Dashboard!$L$36,FALSE))","v":""}]
[{"$nulls":49},"",{"$nulls":11},"",{"$nulls":11},"",{"$nulls":4},"",null,{"$f":"IF(BV116=\"\",\"\",AVERAGE($BV$10:BV116))","v":""},null,{"$f":"IF(BV116=\"\",\"\",_xlfn.NORM.DIST(BV116,AVERAGE($BV$10:$BV$5000),Dashboard!$L$36,FALSE))","v":""},{"$nulls":5},{"$f":"IF(BV116=\"\",\"\",_xlfn.NORM.DIST(BV116,AVERAGE(BV116:BW5106),Dashboard!$L$36,FALSE))","v":""}]
[{"$nulls":49},"",{"$nulls":11},"",{"$nulls":11},"",{"$nulls":4},"",null,{"$f":"IF(BV117=\"\",\"\",AVERAGE($BV$10:BV117))","v":""},null,{"$f":"IF(BV117=\"\",\"\",_xlfn.NORM.DIST(BV117,AVERAGE($BV$10:$BV$5000),Dashboard!$L$36,FALSE))","v":""},{"$nulls":5},{"$f":"IF(BV117=\"\",\"\",_xlfn.NORM.DIST(BV117,AVERAGE(BV117:BW5107),Dashboard!$L$36,FALSE))","v":""}]
[{"$nulls":49},"",{"$nulls":11},"",{"$nulls":11},"",{"$nulls":4},"",null,{"$f":"IF(BV118=\"\",\"\",AVERAGE($BV$10:BV118))","v":""},null,{"$f":"IF(BV118=\"\",\"\",_xlfn.NORM.DIST(BV118,AVERAGE($BV$10:$BV$5000),Dashboard!$L$36,FALSE))","v":""},{"$nulls":5},{"$f":"IF(BV118=\"\",\"\",_xlfn.NORM.DIST(BV118,AVERAGE(BV118:BW5108),Dashboard!$L$36,FALSE))","v":""}]
[{"$nulls":49},"",{"$nulls":11},"",{"$nulls":11},"",{"$nulls":4},"",null,{"$f":"IF(BV119=\"\",\"\",AVERAGE($BV$10:BV119))","v":""},null,{"$f":"IF(BV119=\"\",\"\",_xlfn.NORM.DIST(BV119,AVERAGE($BV$10:$BV$5000),Dashboard!$L$36,FALSE))","v":""},{"$nulls":5},{"$f":"IF(BV119=\"\",\"\",_xlfn.NORM.DIST(BV119,AVERAGE(BV119:BW5109),Dashboard!$L$36,FALSE))","v":""}]
[{"$nulls":49},"",{"$nulls":11},"",{"$nulls":11},"",{"$nulls":4},"",null,{"$f":"IF(BV120=\"\",\"\",AVERAGE($BV$10:BV120))","v":""},null,{"$f":"IF(BV120=\"\",\"\",_xlfn.NORM.DIST(BV120,AVERAGE($BV$10:$BV$5000),Dashboard!$L$36,FALSE))","v":""},{"$nulls":5},{"$f":"IF(BV120=\"\",\"\",_xlfn.NORM.DIST(BV120,AVERAGE(BV120:BW5110),Dashboard!$L$36,FALSE))","v":""}]
[{"$nulls":49},"",{"$nulls":11},"",{"$nulls":11},"",{"$nulls":4},"",null,{"$f":"IF(BV121=\"\",\"\",AVERAGE($BV$10:BV121))","v":""},null,{"$f":"IF(BV121=\"\",\"\",_xlfn.NORM.DIST(BV121,AVERAGE($BV$10:$BV$5000),Dashboard!$L$36,FALSE))","v":""},{"$nulls":5},{"$f":"IF(BV121=\"\",\"\",_xlfn.NORM.DIST(BV121,AVERAGE(BV121:BW5111),Dashboard!$L$36,FALSE))","v":""}]
[{"$nulls":49},"",{"$nulls":11},"",{"$nulls":11},"",{"$nulls":4},"",null,{"$f":"IF(BV122=\"\",\"\",AVERAGE($BV$10:BV122))","v":""},null,{"$f":"IF(BV122=\"\",\"\",_xlfn.NORM.DIST(BV122,AVERAGE($BV$10:$BV$5000),Dashboard!$L$36,FALSE))","v":""},{"$nulls":5},{"$f":"IF(BV122=\"\",\"\",_xlfn.NORM.DIST(BV122,AVERAGE(BV122:BW5112),Dashboard!$L$36,FALSE))","v":""}]
[{"$nulls":49},"",{"$nulls":11},"",{"$nulls":11},"",{"$nulls":4},"",null,{"$f":"IF(BV123=\"\",\"\",AVERAGE($BV$10:BV123))","v":""},null,{"$f":"IF(BV123=\"\",\"\",_xlfn.NORM.DIST(BV123,AVERAGE($BV$10:$BV$5000),Dashboard!$L$36,FALSE))","v":""},{"$nulls":5},{"$f":"IF(BV123=\"\",\"\",_xlfn.NORM.DIST(BV123,AVERAGE(BV123:BW5113),Dashboard!$L$36,FALSE))","v":""}]
[{"$nulls":49},"",{"$nulls":11},"",{"$nulls":11},"",{"$nulls":4},"",null,{"$f":"IF(BV124=\"\",\"\",AVERAGE($BV$10:BV124))","v":""},null,{"$f":"IF(BV124=\"\",\"\",_xlfn.NORM.DIST(BV124,AVERAGE($BV$10:$BV$5000),Dashboard!$L$36,FALSE))","v":""},{"$nulls":5},{"$f":"IF(BV124=\"\",\"\",_xlfn.NORM.DIST(BV124,AVERAGE(BV124:BW5114),Dashboard!$L$36,FALSE))","v":""}]
[{"$nulls":49},"",{"$nulls":11},"",{"$nulls":11},"",{"$nulls":4},"",null,{"$f":"IF(BV125=\"\",\"\",AVERAGE($BV$10:BV125))","v":""},null,{"$f":"IF(BV125=\"\",\"\",_xlfn.NORM.DIST(BV125,AVERAGE($BV$10:$BV$5000),Dashboard!$L$36,FALSE))","v":""},{"$nulls":5},{"$f":"IF(BV125=\"\",\"\",_xlfn.NORM.DIST(BV125,AVERAGE(BV125:BW5115),Dashboard!$L$36,FALSE))","v":""}]
[{"$nulls":49},"",{"$nulls":11},"",{"$nulls":11},"",{"$nulls":4},"",null,{"$f":"IF(BV126=\"\",\"\",AVERAGE($BV$10:BV126))","v":""},null,{"$f":"IF(BV126=\"\",\"\",_xlfn.NORM.DIST(BV126,AVERAGE($BV$10:$BV$5000),Dashboard!$L$36,FALSE))","v":""},{"$nulls":5},{"$f":"IF(BV126=\"\",\"\",_xlfn.NORM.DIST(BV126,AVERAGE(BV126:BW5116),Dashboard!$L$36,FALSE))","v":""}]
[{"$nulls":49},"",{"$nulls":11},"",{"$nulls":11},"",{"$nulls":4},"",null,{"$f":"IF(BV127=\"\",\"\",AVERAGE($BV$10:BV127))","v":""},null,{"$f":"IF(BV127=\"\",\"\",_xlfn.NORM.DIST(BV127,AVERAGE($BV$10:$BV$5000),Dashboard!$L$36,FALSE))","v":""},{"$nulls":5},{"$f":"IF(BV127=\"\",\"\",_xlfn.NORM.DIST(BV127,AVERAGE(BV127:BW5117),Dashboard!$L$36,FALSE))","v":""}]
[{"$nulls":49},"",{"$nulls":11},"",{"$nulls":11},"",{"$nulls":4},"",null,{"$f":"IF(BV128=\"\",\"\",AVERAGE($BV$10:BV128))","v":""},null,{"$f":"IF(BV128=\"\",\"\",_xlfn.NORM.DIST(BV128,AVERAGE($BV$10:$BV$5000),Dashboard!$L$36,FALSE))","v":""},{"$nulls":5},{"$f":"IF(BV128=\"\",\"\",_xlfn.NORM.DIST(BV128,AVERAGE(BV128:BW5118),Dashboard!$L$36,FALSE))","v":""}]
[{"$nulls":49},"",{"$nulls":11},"",{"$nulls":11},"",{"$nulls":4},"",null,{"$f":"IF(BV129=\"\",\"\",AVERAGE($BV$10:BV129))","v":""},null,{"$f":"IF(BV129=\"\",\"\",_xlfn.NORM.DIST(BV129,AVERAGE($BV$10:$BV$5000),Dashboard!$L$36,FALSE))","v":""},{"$nulls":5},{"$f":"IF(BV129=\"\",\"\",_xlfn.NORM.DIST(BV129,AVERAGE(BV129:BW5119),Dashboard!$L$36,FALSE))","v":""}]
[{"$nulls":49},"",{"$nulls":11},"",{"$nulls":11},"",{"$nulls":4},"",null,{"$f":"IF(BV130=\"\",\"\",AVERAGE($BV$10:BV130))","v":""},null,{"$f":"IF(BV130=\"\",\"\",_xlfn.NORM.DIST(BV130,AVERAGE($BV$10:$BV$5000),Dashboard!$L$36,FALSE))","v":""},{"$nulls":5},{"$f":"IF(BV130=\"\",\"\",_xlfn.NORM.DIST(BV130,AVERAGE(BV130:BW5120),Dashboard!$L$36,FALSE))","v":""}]
[{"$nulls":49},"",{"$nulls":11},"",{"$nulls":11},"",{"$nulls":4},"",null,{"$f":"IF(BV131=\"\",\"\",AVERAGE($BV$10:BV131))","v":""},null,{"$f":"IF(BV131=\"\",\"\",_xlfn.NORM.DIST(BV131,AVERAGE($BV$10:$BV$5000),Dashboard!$L$36,FALSE))","v":""},{"$nulls":5},{"$f":"IF(BV131=\"\",\"\",_xlfn.NORM.DIST(BV131,AVERAGE(BV131:BW5121),Dashboard!$L$36,FALSE))","v":""}]
[{"$nulls":49},"",{"$nulls":11},"",{"$nulls":11},"",{"$nulls":4},"",null,{"$f":"IF(BV132=\"\",\"\",AVERAGE($BV$10:BV132))","v":""},null,{"$f":"IF(BV132=\"\",\"\",_xlfn.NORM.DIST(BV132,AVERAGE($BV$10:$BV$5000),Dashboard!$L$36,FALSE))","v":""},{"$nulls":5},{"$f":"IF(BV132=\"\",\"\",_xlfn.NORM.DIST(BV132,AVERAGE(BV132:BW5122),Dashboard!$L$36,FALSE))","v":""}]
[{"$nulls":49},"",{"$nulls":11},"",{"$nulls":11},"",{"$nulls":4},"",null,{"$f":"IF(BV133=\"\",\"\",AVERAGE($BV$10:BV133))","v":""},null,{"$f":"IF(BV133=\"\",\"\",_xlfn.NORM.DIST(BV133,AVERAGE($BV$10:$BV$5000),Dashboard!$L$36,FALSE))","v":""},{"$nulls":5},{"$f":"IF(BV133=\"\",\"\",_xlfn.NORM.DIST(BV133,AVERAGE(BV133:BW5123),Dashboard!$L$36,FALSE))","v":""}]
[{"$nulls":49},"",{"$nulls":11},"",{"$nulls":11},"",{"$nulls":4},"",null,{"$f":"IF(BV134=\"\",\"\",AVERAGE($BV$10:BV134))","v":""},null,{"$f":"IF(BV134=\"\",\"\",_xlfn.NORM.DIST(BV134,AVERAGE($BV$10:$BV$5000),Dashboard!$L$36,FALSE))","v":""},{"$nulls":5},{"$f":"IF(BV134=\"\",\"\",_xlfn.NORM.DIST(BV134,AVERAGE(BV134:BW5124),Dashboard!$L$36,FALSE))","v":""}]
[{"$nulls":49},"",{"$nulls":11},"",{"$nulls":11},"",{"$nulls":4},"",null,{"$f":"IF(BV135=\"\",\"\",AVERAGE($BV$10:BV135))","v":""},null,{"$f":"IF(BV135=\"\",\"\",_xlfn.NORM.DIST(BV135,AVERAGE($BV$10:$BV$5000),Dashboard!$L$36,FALSE))","v":""},{"$nulls":5},{"$f":"IF(BV135=\"\",\"\",_xlfn.NORM.DIST(BV135,AVERAGE(BV135:BW5125),Dashboard!$L$36,FALSE))","v":""}]
[{"$nulls":49},"",{"$nulls":11},"",{"$nulls":11},"",{"$nulls":4},"",null,{"$f":"IF(BV136=\"\",\"\",AVERAGE($BV$10:BV136))","v":""},null,{"$f":"IF(BV136=\"\",\"\",_xlfn.NORM.DIST(BV136,AVERAGE($BV$10:$BV$5000),Dashboard!$L$36,FALSE))","v":""},{"$nulls":5},{"$f":"IF(BV136=\"\",\"\",_xlfn.NORM.DIST(BV136,AVERAGE(BV136:BW5126),Dashboard!$L$36,FALSE))","v":""}]
[{"$nulls":49},"",{"$nulls":11},"",{"$nulls":11},"",{"$nulls":4},"",null,{"$f":"IF(BV137=\"\",\"\",AVERAGE($BV$10:BV137))","v":""},null,{"$f":"IF(BV137=\"\",\"\",_xlfn.NORM.DIST(BV137,AVERAGE($BV$10:$BV$5000),Dashboard!$L$36,FALSE))","v":""},{"$nulls":5},{"$f":"IF(BV137=\"\",\"\",_xlfn.NORM.DIST(BV137,AVERAGE(BV137:BW5127),Dashboard!$L$36,FALSE))","v":""}]
[{"$nulls":49},"",{"$nulls":11},"",{"$nulls":11},"",{"$nulls":4},"",null,{"$f":"IF(BV138=\"\",\"\",AVERAGE($BV$10:BV138))","v":""},null,{"$f":"IF(BV138=\"\",\"\",_xlfn.NORM.DIST(BV138,AVERAGE($BV$10:$BV$5000),Dashboard!$L$36,FALSE))","v":""},{"$nulls":5},{"$f":"IF(BV138=\"\",\"\",_xlfn.NORM.DIST(BV138,AVERAGE(BV138:BW5128),Dashboard!$L$36,FALSE))","v":""}]
[{"$nulls":49},"",{"$nulls":11},"",{"$nulls":11},"",{"$nulls":4},"",null,{"$f":"IF(BV139=\"\",\"\",AVERAGE($BV$10:BV139))","v":""},null,{"$f":"IF(BV139=\"\",\"\",_xlfn.NORM.DIST(BV139,AVERAGE($BV$10:$BV$5000),Dashboard!$L$36,FALSE))","v":""},{"$nulls":5},{"$f":"IF(BV139=\"\",\"\",_xlfn.NORM.DIST(BV139,AVERAGE(BV139:BW5129),Dashboard!$L$36,FALSE))","v":""}]
[{"$nulls":49},"",{"$nulls":11},"",{"$nulls":11},"",{"$nulls":4},"",null,{"$f":"IF(BV140=\"\",\"\",AVERAGE($BV$10:BV140))","v":""},null,{"$f":"IF(BV140=\"\",\"\",_xlfn.NORM.DIST(BV140,AVERAGE($BV$10:$BV$5000),Dashboard!$L$36,FALSE))","v":""},{"$nulls":5},{"$f":"IF(BV140=\"\",\"\",_xlfn.NORM.DIST(BV140,AVERAGE(BV140:BW5130),Dashboard!$L$36,FALSE))","v":""}]
[{"$nulls":49},"",{"$nulls":11},"",{"$nulls":11},"",{"$nulls":4},"",null,{"$f":"IF(BV141=\"\",\"\",AVERAGE($BV$10:BV141))","v":""},null,{"$f":"IF(BV141=\"\",\"\",_xlfn.NORM.DIST(BV141,AVERAGE($BV$10:$BV$5000),Dashboard!$L$36,FALSE))","v":""},{"$nulls":5},{"$f":"IF(BV141=\"\",\"\",_xlfn.NORM.DIST(BV141,AVERAGE(BV141:BW5131),Dashboard!$L$36,FALSE))","v":""}]
[{"$nulls":49},"",{"$nulls":11},"",{"$nulls":11},"",{"$nulls":4},"",null,{"$f":"IF(BV142=\"\",\"\",AVERAGE($BV$10:BV142))","v":""},null,{"$f":"IF(BV142=\"\",\"\",_xlfn.NORM.DIST(BV142,AVERAGE($BV$10:$BV$5000),Dashboard!$L$36,FALSE))","v":""},{"$nulls":5},{"$f":"IF(BV142=\"\",\"\",_xlfn.NORM.DIST(BV142,AVERAGE(BV142:BW5132),Dashboard!$L$36,FALSE))","v":""}]
[{"$nulls":49},"",{"$nulls":11},"",{"$nulls":11},"",{"$nulls":4},"",null,{"$f":"IF(BV143=\"\",\"\",AVERAGE($BV$10:BV143))","v":""},null,{"$f":"IF(BV143=\"\",\"\",_xlfn.NORM.DIST(BV143,AVERAGE($BV$10:$BV$5000),Dashboard!$L$36,FALSE))","v":""},{"$nulls":5},{"$f":"IF(BV143=\"\",\"\",_xlfn.NORM.DIST(BV143,AVERAGE(BV143:BW5133),Dashboard!$L$36,FALSE))","v":""}]
[{"$nulls":49},"",{"$nulls":11},"",{"$nulls":11},"",{"$nulls":4},"",null,{"$f":"IF(BV144=\"\",\"\",AVERAGE($BV$10:BV144))","v":""},null,{"$f":"IF(BV144=\"\",\"\",_xlfn.NORM.DIST(BV144,AVERAGE($BV$10:$BV$5000),Dashboard!$L$36,FALSE))","v":""},{"$nulls":5},{"$f":"IF(BV144=\"\",\"\",_xlfn.NORM.DIST(BV144,AVERAGE(BV144:BW5134),Dashboard!$L$36,FALSE))","v":""}]
[{"$nulls":49},"",{"$nulls":11},"",{"$nulls":11},"",{"$nulls":4},"",null,{"$f":"IF(BV145=\"\",\"\",AVERAGE($BV$10:BV145))","v":""},null,{"$f":"IF(BV145=\"\",\"\",_xlfn.NORM.DIST(BV145,AVERAGE($BV$10:$BV$5000),Dashboard!$L$36,FALSE))","v":""},{"$nulls":5},{"$f":"IF(BV145=\"\",\"\",_xlfn.NORM.DIST(BV145,AVERAGE(BV145:BW5135),Dashboard!$L$36,FALSE))","v":""}]
[{"$nulls":49},"",{"$nulls":11},"",{"$nulls":11},"",{"$nulls":4},"",null,{"$f":"IF(BV146=\"\",\"\",AVERAGE($BV$10:BV146))","v":""},null,{"$f":"IF(BV146=\"\",\"\",_xlfn.NORM.DIST(BV146,AVERAGE($BV$10:$BV$5000),Dashboard!$L$36,FALSE))","v":""},{"$nulls":5},{"$f":"IF(BV146=\"\",\"\",_xlfn.NORM.DIST(BV146,AVERAGE(BV146:BW5136),Dashboard!$L$36,FALSE))","v":""}]
[{"$nulls":49},"",{"$nulls":11},"",{"$nulls":11},"",{"$nulls":4},"",null,{"$f":"IF(BV147=\"\",\"\",AVERAGE($BV$10:BV147))","v":""},null,{"$f":"IF(BV147=\"\",\"\",_xlfn.NORM.DIST(BV147,AVERAGE($BV$10:$BV$5000),Dashboard!$L$36,FALSE))","v":""},{"$nulls":5},{"$f":"IF(BV147=\"\",\"\",_xlfn.NORM.DIST(BV147,AVERAGE(BV147:BW5137),Dashboard!$L$36,FALSE))","v":""}]
[{"$nulls":49},"",{"$nulls":11},"",{"$nulls":11},"",{"$nulls":4},"",null,{"$f":"IF(BV148=\"\",\"\",AVERAGE($BV$10:BV148))","v":""},null,{"$f":"IF(BV148=\"\",\"\",_xlfn.NORM.DIST(BV148,AVERAGE($BV$10:$BV$5000),Dashboard!$L$36,FALSE))","v":""},{"$nulls":5},{"$f":"IF(BV148=\"\",\"\",_xlfn.NORM.DIST(BV148,AVERAGE(BV148:BW5138),Dashboard!$L$36,FALSE))","v":""}]
[{"$nulls":49},{"$f":"IF(SUM(AR149:AW149)=0,\"\",AVERAGE(AR149:AW149))","v":""},{"$nulls":11},{"$f":"IF(SUM(BD149:BI149)=0,\"\",AVERAGE(BD149:BI149))","v":""},{"$nulls":11},{"$f":"IF(SUM(BP149:BU149)=0,\"\",AVERAGE(BP149:BU149))","v":""},{"$nulls":4},{"$f":"IF(BV149=\"\",\"\",BV149-AJ149)","v":""},null,{"$f":"IF(BV149=\"\",\"\",AVERAGE($BV$10:BV149))","v":""},null,{"$f":"IF(BV149=\"\",\"\",_xlfn.NORM.DIST(BV149,AVERAGE($BV$10:$BV$5000),Dashboard!$L$36,FALSE))","v":""},{"$nulls":5},{"$f":"IF(BV149=\"\",\"\",_xlfn.NORM.DIST(BV149,AVERAGE(BV149:BW5139),Dashboard!$L$36,FALSE))","v":""}]
[{"$nulls":49},"",{"$nulls":11},"",{"$nulls":11},"",{"$nulls":4},"",null,{"$f":"IF(BV150=\"\",\"\",AVERAGE($BV$10:BV150))","v":""},null,{"$f":"IF(BV150=\"\",\"\",_xlfn.NORM.DIST(BV150,AVERAGE($BV$10:$BV$5000),Dashboard!$L$36,FALSE))","v":""},{"$nulls":5},{"$f":"IF(BV150=\"\",\"\",_xlfn.NORM.DIST(BV150,AVERAGE(BV150:BW5140),Dashboard!$L$36,FALSE))","v":""}]
[{"$nulls":49},"",{"$nulls":11},"",{"$nulls":11},"",{"$nulls":4},"",null,{"$f":"IF(BV151=\"\",\"\",AVERAGE($BV$10:BV151))","v":""},null,{"$f":"IF(BV151=\"\",\"\",_xlfn.NORM.DIST(BV151,AVERAGE($BV$10:$BV$5000),Dashboard!$L$36,FALSE))","v":""},{"$nulls":5},{"$f":"IF(BV151=\"\",\"\",_xlfn.NORM.DIST(BV151,AVERAGE(BV151:BW5141),Dashboard!$L$36,FALSE))","v":""}]
[{"$nulls":49},"",{"$nulls":11},"",{"$nulls":11},"",{"$nulls":4},"",null,{"$f":"IF(BV152=\"\",\"\",AVERAGE($BV$10:BV152))","v":""},null,{"$f":"IF(BV152=\"\",\"\",_xlfn.NORM.DIST(BV152,AVERAGE($BV$10:$BV$5000),Dashboard!$L$36,FALSE))","v":""},{"$nulls":5},{"$f":"IF(BV152=\"\",\"\",_xlfn.NORM.DIST(BV152,AVERAGE(BV152:BW5142),Dashboard!$L$36,FALSE))","v":""}]
[{"$nulls":49},"",{"$nulls":11},"",{"$nulls":11},"",{"$nulls":4},"",null,{"$f":"IF(BV153=\"\",\"\",AVERAGE($BV$10:BV153))","v":""},null,{"$f":"IF(BV153=\"\",\"\",_xlfn.NORM.DIST(BV153,AVERAGE($BV$10:$BV$5000),Dashboard!$L$36,FALSE))","v":""},{"$nulls":5},{"$f":"IF(BV153=\"\",\"\",_xlfn.NORM.DIST(BV153,AVERAGE(BV153:BW5143),Dashboard!$L$36,FALSE))","v":""}]
[{"$nulls":49},"",{"$nulls":11},"",{"$nulls":11},"",{"$nulls":4},"",null,{"$f":"IF(BV154=\"\",\"\",AVERAGE($BV$10:BV154))","v":""},null,{"$f":"IF(BV154=\"\",\"\",_xlfn.NORM.DIST(BV154,AVERAGE($BV$10:$BV$5000),Dashboard!$L$36,FALSE))","v":""},{"$nulls":5},{"$f":"IF(BV154=\"\",\"\",_xlfn.NORM.DIST(BV154,AVERAGE(BV154:BW5144),Dashboard!$L$36,FALSE))","v":""}]
[{"$nulls":49},"",{"$nulls":11},"",{"$nulls":11},"",{"$nulls":4},"",null,{"$f":"IF(BV155=\"\",\"\",AVERAGE($BV$10:BV155))","v":""},null,{"$f":"IF(BV155=\"\",\"\",_xlfn.NORM.DIST(BV155,AVERAGE($BV$10:$BV$5000),Dashboard!$L$36,FALSE))","v":""},{"$nulls":5},{"$f":"IF(BV155=\"\",\"\",_xlfn.NORM.DIST(BV155,AVERAGE(BV155:BW5145),Dashboard!$L$36,FALSE))","v":""}]
[{"$nulls":49},"",{"$nulls":11},"",{"$nulls":11},"",{"$nulls":4},"",null,{"$f":"IF(BV156=\"\",\"\",AVERAGE($BV$10:BV156))","v":""},null,{"$f":"IF(BV156=\"\",\"\",_xlfn.NORM.DIST(BV156,AVERAGE($BV$10:$BV$5000),Dashboard!$L$36,FALSE))","v":""},{"$nulls":5},{"$f":"IF(BV156=\"\",\"\",_xlfn.NORM.DIST(BV156,AVERAGE(BV156:BW5146),Dashboard!$L$36,FALSE))","v":""}]
[{"$nulls":49},"",{"$nulls":11},"",{"$nulls":11},"",{"$nulls":4},"",null,{"$f":"IF(BV157=\"\",\"\",AVERAGE($BV$10:BV157))","v":""},null,{"$f":"IF(BV157=\"\",\"\",_xlfn.NORM.DIST(BV157,AVERAGE($BV$10:$BV$5000),Dashboard!$L$36,FALSE))","v":""},{"$nulls":5},{"$f":"IF(BV157=\"\",\"\",_xlfn.NORM.DIST(BV157,AVERAGE(BV157:BW5147),Dashboard!$L$36,FALSE))","v":""}]
[{"$nulls":49},"",{"$nulls":11},"",{"$nulls":11},"",{"$nulls":4},"",null,{"$f":"IF(BV158=\"\",\"\",AVERAGE($BV$10:BV158))","v":""},null,{"$f":"IF(BV158=\"\",\"\",_xlfn.NORM.DIST(BV158,AVERAGE($BV$10:$BV$5000),Dashboard!$L$36,FALSE))","v":""},{"$nulls":5},{"$f":"IF(BV158=\"\",\"\",_xlfn.NORM.DIST(BV158,AVERAGE(BV158:BW5148),Dashboard!$L$36,FALSE))","v":""}]
[{"$nulls":49},"",{"$nulls":11},"",{"$nulls":11},"",{"$nulls":4},"",null,{"$f":"IF(BV159=\"\",\"\",AVERAGE($BV$10:BV159))","v":""},null,{"$f":"IF(BV159=\"\",\"\",_xlfn.NORM.DIST(BV159,AVERAGE($BV$10:$BV$5000),Dashboard!$L$36,FALSE))","v":""},{"$nulls":5},{"$f":"IF(BV159=\"\",\"\",_xlfn.NORM.DIST(BV159,AVERAGE(BV159:BW5149),Dashboard!$L$36,FALSE))","v":""}]
[{"$nulls":49},"",{"$nulls":11},"",{"$nulls":11},"",{"$nulls":4},"",null,{"$f":"IF(BV160=\"\",\"\",AVERAGE($BV$10:BV160))","v":""},null,{"$f":"IF(BV160=\"\",\"\",_xlfn.NORM.DIST(BV160,AVERAGE($BV$10:$BV$5000),Dashboard!$L$36,FALSE))","v":""},{"$nulls":5},{"$f":"IF(BV160=\"\",\"\",_xlfn.NORM.DIST(BV160,AVERAGE(BV160:BW5150),Dashboard!$L$36,FALSE))","v":""}]
[{"$nulls":49},"",{"$nulls":11},"",{"$nulls":11},"",{"$nulls":4},"",null,{"$f":"IF(BV161=\"\",\"\",AVERAGE($BV$10:BV161))","v":""},null,{"$f":"IF(BV161=\"\",\"\",_xlfn.NORM.DIST(BV161,AVERAGE($BV$10:$BV$5000),Dashboard!$L$36,FALSE))","v":""},{"$nulls":5},{"$f":"IF(BV161=\"\",\"\",_xlfn.NORM.DIST(BV161,AVERAGE(BV161:BW5151),Dashboard!$L$36,FALSE))","v":""}]
[{"$nulls":49},"",{"$nulls":11},"",{"$nulls":11},"",{"$nulls":4},"",null,{"$f":"IF(BV162=\"\",\"\",AVERAGE($BV$10:BV162))","v":""},null,{"$f":"IF(BV162=\"\",\"\",_xlfn.NORM.DIST(BV162,AVERAGE($BV$10:$BV$5000),Dashboard!$L$36,FALSE))","v":""},{"$nulls":5},{"$f":"IF(BV162=\"\",\"\",_xlfn.NORM.DIST(BV162,AVERAGE(BV162:BW5152),Dashboard!$L$36,FALSE))","v":""}]
[{"$nulls":49},"",{"$nulls":11},"",{"$nulls":11},"",{"$nulls":4},"",null,{"$f":"IF(BV163=\"\",\"\",AVERAGE($BV$10:BV163))","v":""},null,{"$f":"IF(BV163=\"\",\"\",_xlfn.NORM.DIST(BV163,AVERAGE($BV$10:$BV$5000),Dashboard!$L$36,FALSE))","v":""},{"$nulls":5},{"$f":"IF(BV163=\"\",\"\",_xlfn.NORM.DIST(BV163,AVERAGE(BV163:BW5153),Dashboard!$L$36,FALSE))","v":""}]
[{"$nulls":49},"",{"$nulls":11},"",{"$nulls":11},"",{"$nulls":4},"",null,{"$f":"IF(BV164=\"\",\"\",AVERAGE($BV$10:BV164))","v":""},null,{"$f":"IF(BV164=\"\",\"\",_xlfn.NORM.DIST(BV164,AVERAGE($BV$10:$BV$5000),Dashboard!$L$36,FALSE))","v":""},{"$nulls":5},{"$f":"IF(BV164=\"\",\"\",_xlfn.NORM.DIST(BV164,AVERAGE(BV164:BW5154),Dashboard!$L$36,FALSE))","v":""}]
[{"$nulls":49},"",{"$nulls":11},"",{"$nulls":11},"",{"$nulls":4},"",null,{"$f":"IF(BV165=\"\",\"\",AVERAGE($BV$10:BV165))","v":""},null,{"$f":"IF(BV165=\"\",\"\",_xlfn.NORM.DIST(BV165,AVERAGE($BV$10:$BV$5000),Dashboard!$L$36,FALSE))","v":""},{"$nulls":5},{"$f":"IF(BV165=\"\",\"\",_xlfn.NORM.DIST(BV165,AVERAGE(BV165:BW5155),Dashboard!$L$36,FALSE))","v":""}]
[{"$nulls":49},"",{"$nulls":11},"",{"$nulls":11},"",{"$nulls":4},"",null,{"$f":"IF(BV166=\"\",\"\",AVERAGE($BV$10:BV166))","v":""},null,{"$f":"IF(BV166=\"\",\"\",_xlfn.NORM.DIST(BV166,AVERAGE($BV$10:$BV$5000),Dashboard!$L$36,FALSE))","v":""},{"$nulls":5},{"$f":"IF(BV166=\"\",\"\",_xlfn.NORM.DIST(BV166,AVERAGE(BV166:BW5156),Dashboard!$L$36,FALSE))","v":""}]
[{"$nulls":49},"",{"$nulls":11},"",{"$nulls":11},"",{"$nulls":4},"",null,{"$f":"IF(BV167=\"\",\"\",AVERAGE($BV$10:BV167))","v":""},null,{"$f":"IF(BV167=\"\",\"\",_xlfn.NORM.DIST(BV167,AVERAGE($BV$10:$BV$5000),Dashboard!$L$36,FALSE))","v":""},{"$nulls":5},{"$f":"IF(BV167=\"\",\"\",_xlfn.NORM.DIST(BV167,AVERAGE(BV167:BW5157),Dashboard!$L$36,FALSE))","v":""}]
[{"$nulls":49},"",{"$nulls":11},"",{"$nulls":11},"",{"$nulls":4},"",null,{"$f":"IF(BV168=\"\",\"\",AVERAGE($BV$10:BV168))","v":""},null,{"$f":"IF(BV168=\"\",\"\",_xlfn.NORM.DIST(BV168,AVERAGE($BV$10:$BV$5000),Dashboard!$L$36,FALSE))","v":""},{"$nulls":5},{"$f":"IF(BV168=\"\",\"\",_xlfn.NORM.DIST(BV168,AVERAGE(BV168:BW5158),Dashboard!$L$36,FALSE))","v":""}]
[{"$nulls":49},"",{"$nulls":11},"",{"$nulls":11},"",{"$nulls":4},"",null,{"$f":"IF(BV169=\"\",\"\",AVERAGE($BV$10:BV169))","v":""},null,{"$f":"IF(BV169=\"\",\"\",_xlfn.NORM.DIST(BV169,AVERAGE($BV$10:$BV$5000),Dashboard!$L$36,FALSE))","v":""},{"$nulls":5},{"$f":"IF(BV169=\"\",\"\",_xlfn.NORM.DIST(BV169,AVERAGE(BV169:BW5159),Dashboard!$L$36,FALSE))","v":""}]
[{"$nulls":49},"",{"$nulls":11},"",{"$nulls":11},"",{"$nulls":4},"",null,{"$f":"IF(BV170=\"\",\"\",AVERAGE($BV$10:BV170))","v":""},null,{"$f":"IF(BV170=\"\",\"\",_xlfn.NORM.DIST(BV170,AVERAGE($BV$10:$BV$5000),Dashboard!$L$36,FALSE))","v":""},{"$nulls":5},{"$f":"IF(BV170=\"\",\"\",_xlfn.NORM.DIST(BV170,AVERAGE(BV170:BW5160),Dashboard!$L$36,FALSE))","v":""}]
[{"$nulls":49},"",{"$nulls":11},"",{"$nulls":11},"",{"$nulls":4},"",null,{"$f":"IF(BV171=\"\",\"\",AVERAGE($BV$10:BV171))","v":""},null,{"$f":"IF(BV171=\"\",\"\",_xlfn.NORM.DIST(BV171,AVERAGE($BV$10:$BV$5000),Dashboard!$L$36,FALSE))","v":""},{"$nulls":5},{"$f":"IF(BV171=\"\",\"\",_xlfn.NORM.DIST(BV171,AVERAGE(BV171:BW5161),Dashboard!$L$36,FALSE))","v":""}]
[{"$nulls":49},"",{"$nulls":11},"",{"$nulls":11},"",{"$nulls":4},"",null,{"$f":"IF(BV172=\"\",\"\",AVERAGE($BV$10:BV172))","v":""},null,{"$f":"IF(BV172=\"\",\"\",_xlfn.NORM.DIST(BV172,AVERAGE($BV$10:$BV$5000),Dashboard!$L$36,FALSE))","v":""},{"$nulls":5},{"$f":"IF(BV172=\"\",\"\",_xlfn.NORM.DIST(BV172,AVERAGE(BV172:BW5162),Dashboard!$L$36,FALSE))","v":""}]
[{"$nulls":49},"",{"$nulls":11},"",{"$nulls":11},"",{"$nulls":4},"",null,{"$f":"IF(BV173=\"\",\"\",AVERAGE($BV$10:BV173))","v":""},null,{"$f":"IF(BV173=\"\",\"\",_xlfn.NORM.DIST(BV173,AVERAGE($BV$10:$BV$5000),Dashboard!$L$36,FALSE))","v":""},{"$nulls":5},{"$f":"IF(BV173=\"\",\"\",_xlfn.NORM.DIST(BV173,AVERAGE(BV173:BW5163),Dashboard!$L$36,FALSE))","v":""}]
[{"$nulls":49},"",{"$nulls":11},"",{"$nulls":11},"",{"$nulls":4},"",null,{"$f":"IF(BV174=\"\",\"\",AVERAGE($BV$10:BV174))","v":""},null,{"$f":"IF(BV174=\"\",\"\",_xlfn.NORM.DIST(BV174,AVERAGE($BV$10:$BV$5000),Dashboard!$L$36,FALSE))","v":""},{"$nulls":5},{"$f":"IF(BV174=\"\",\"\",_xlfn.NORM.DIST(BV174,AVERAGE(BV174:BW5164),Dashboard!$L$36,FALSE))","v":""}]
[{"$nulls":49},"",{"$nulls":11},"",{"$nulls":11},"",{"$nulls":4},"",null,{"$f":"IF(BV175=\"\",\"\",AVERAGE($BV$10:BV175))","v":""},null,{"$f":"IF(BV175=\"\",\"\",_xlfn.NORM.DIST(BV175,AVERAGE($BV$10:$BV$5000),Dashboard!$L$36,FALSE))","v":""},{"$nulls":5},{"$f":"IF(BV175=\"\",\"\",_xlfn.NORM.DIST(BV175,AVERAGE(BV175:BW5165),Dashboard!$L$36,FALSE))","v":""}]
[{"$nulls":49},"",{"$nulls":11},"",{"$nulls":11},"",{"$nulls":4},"",null,{"$f":"IF(BV176=\"\",\"\",AVERAGE($BV$10:BV176))","v":""},null,{"$f":"IF(BV176=\"\",\"\",_xlfn.NORM.DIST(BV176,AVERAGE($BV$10:$BV$5000),Dashboard!$L$36,FALSE))","v":""},{"$nulls":5},{"$f":"IF(BV176=\"\",\"\",_xlfn.NORM.DIST(BV176,AVERAGE(BV176:BW5166),Dashboard!$L$36,FALSE))","v":""}]
[{"$nulls":49},"",{"$nulls":11},"",{"$nulls":11},"",{"$nulls":4},"",null,{"$f":"IF(BV177=\"\",\"\",AVERAGE($BV$10:BV177))","v":""},null,{"$f":"IF(BV177=\"\",\"\",_xlfn.NORM.DIST(BV177,AVERAGE($BV$10:$BV$5000),Dashboard!$L$36,FALSE))","v":""},{"$nulls":5},{"$f":"IF(BV177=\"\",\"\",_xlfn.NORM.DIST(BV177,AVERAGE(BV177:BW5167),Dashboard!$L$36,FALSE))","v":""}]
[{"$nulls":49},"",{"$nulls":11},"",{"$nulls":11},"",{"$nulls":4},"",null,{"$f":"IF(BV178=\"\",\"\",AVERAGE($BV$10:BV178))","v":""},null,{"$f":"IF(BV178=\"\",\"\",_xlfn.NORM.DIST(BV178,AVERAGE($BV$10:$BV$5000),Dashboard!$L$36,FALSE))","v":""},{"$nulls":5},{"$f":"IF(BV178=\"\",\"\",_xlfn.NORM.DIST(BV178,AVERAGE(BV178:BW5168),Dashboard!$L$36,FALSE))","v":""}]
[{"$nulls":49},"",{"$nulls":11},"",{"$nulls":11},"",{"$nulls":4},"",null,{"$f":"IF(BV179=\"\",\"\",AVERAGE($BV$10:BV179))","v":""},null,{"$f":"IF(BV179=\"\",\"\",_xlfn.NORM.DIST(BV179,AVERAGE($BV$10:$BV$5000),Dashboard!$L$36,FALSE))","v":""},{"$nulls":5},{"$f":"IF(BV179=\"\",\"\",_xlfn.NORM.DIST(BV179,AVERAGE(BV179:BW5169),Dashboard!$L$36,FALSE))","v":""}]
[{"$nulls":49},"",{"$nulls":11},"",{"$nulls":11},"",{"$nulls":4},"",null,{"$f":"IF(BV180=\"\",\"\",AVERAGE($BV$10:BV180))","v":""},null,{"$f":"IF(BV180=\"\",\"\",_xlfn.NORM.DIST(BV180,AVERAGE($BV$10:$BV$5000),Dashboard!$L$36,FALSE))","v":""},{"$nulls":5},{"$f":"IF(BV180=\"\",\"\",_xlfn.NORM.DIST(BV180,AVERAGE(BV180:BW5170),Dashboard!$L$36,FALSE))","v":""}]
[{"$nulls":49},"",{"$nulls":11},"",{"$nulls":11},"",{"$nulls":4},"",null,{"$f":"IF(BV181=\"\",\"\",AVERAGE($BV$10:BV181))","v":""},null,{"$f":"IF(BV181=\"\",\"\",_xlfn.NORM.DIST(BV181,AVERAGE($BV$10:$BV$5000),Dashboard!$L$36,FALSE))","v":""},{"$nulls":5},{"$f":"IF(BV181=\"\",\"\",_xlfn.NORM.DIST(BV181,AVERAGE(BV181:BW5171),Dashboard!$L$36,FALSE))","v":""}]
[{"$nulls":49},"",{"$nulls":11},"",{"$nulls":11},"",{"$nulls":4},"",null,{"$f":"IF(BV182=\"\",\"\",AVERAGE($BV$10:BV182))","v":""},null,{"$f":"IF(BV182=\"\",\"\",_xlfn.NORM.DIST(BV182,AVERAGE($BV$10:$BV$5000),Dashboard!$L$36,FALSE))","v":""},{"$nulls":5},{"$f":"IF(BV182=\"\",\"\",_xlfn.NORM.DIST(BV182,AVERAGE(BV182:BW5172),Dashboard!$L$36,FALSE))","v":""}]
[{"$nulls":49},"",{"$nulls":11},"",{"$nulls":11},"",{"$nulls":4},"",null,{"$f":"IF(BV183=\"\",\"\",AVERAGE($BV$10:BV183))","v":""},null,{"$f":"IF(BV183=\"\",\"\",_xlfn.NORM.DIST(BV183,AVERAGE($BV$10:$BV$5000),Dashboard!$L$36,FALSE))","v":""},{"$nulls":5},{"$f":"IF(BV183=\"\",\"\",_xlfn.NORM.DIST(BV183,AVERAGE(BV183:BW5173),Dashboard!$L$36,FALSE))","v":""}]
[{"$nulls":49},"",{"$nulls":11},"",{"$nulls":11},"",{"$nulls":4},"",null,{"$f":"IF(BV184=\"\",\"\",AVERAGE($BV$10:BV184))","v":""},null,{"$f":"IF(BV184=\"\",\"\",_xlfn.NORM.DIST(BV184,AVERAGE($BV$10:$BV$5000),Dashboard!$L$36,FALSE))","v":""},{"$nulls":5},{"$f":"IF(BV184=\"\",\"\",_xlfn.NORM.DIST(BV184,AVERAGE(BV184:BW5174),Dashboard!$L$36,FALSE))","v":""}]
[{"$nulls":49},"",{"$nulls":11},"",{"$nulls":11},"",{"$nulls":4},"",null,{"$f":"IF(BV185=\"\",\"\",AVERAGE($BV$10:BV185))","v":""},null,{"$f":"IF(BV185=\"\",\"\",_xlfn.NORM.DIST(BV185,AVERAGE($BV$10:$BV$5000),Dashboard!$L$36,FALSE))","v":""},{"$nulls":5},{"$f":"IF(BV185=\"\",\"\",_xlfn.NORM.DIST(BV185,AVERAGE(BV185:BW5175),Dashboard!$L$36,FALSE))","v":""}]
[{"$nulls":49},"",{"$nulls":11},"",{"$nulls":11},"",{"$nulls":4},"",null,{"$f":"IF(BV186=\"\",\"\",AVERAGE($BV$10:BV186))","v":""},null,{"$f":"IF(BV186=\"\",\"\",_xlfn.NORM.DIST(BV186,AVERAGE($BV$10:$BV$5000),Dashboard!$L$36,FALSE))","v":""},{"$nulls":5},{"$f":"IF(BV186=\"\",\"\",_xlfn.NORM.DIST(BV186,AVERAGE(BV186:BW5176),Dashboard!$L$36,FALSE))","v":""}]
[{"$nulls":49},"",{"$nulls":11},"",{"$nulls":11},"",{"$nulls":4},"",null,{"$f":"IF(BV187=\"\",\"\",AVERAGE($BV$10:BV187))","v":""},null,{"$f":"IF(BV187=\"\",\"\",_xlfn.NORM.DIST(BV187,AVERAGE($BV$10:$BV$5000),Dashboard!$L$36,FALSE))","v":""},{"$nulls":5},{"$f":"IF(BV187=\"\",\"\",_xlfn.NORM.DIST(BV187,AVERAGE(BV187:BW5177),Dashboard!$L$36,FALSE))","v":""}]
[{"$nulls":49},"",{"$nulls":11},"",{"$nulls":11},"",{"$nulls":4},"",null,{"$f":"IF(BV188=\"\",\"\",AVERAGE($BV$10:BV188))","v":""},null,{"$f":"IF(BV188=\"\",\"\",_xlfn.NORM.DIST(BV188,AVERAGE($BV$10:$BV$5000),Dashboard!$L$36,FALSE))","v":""},{"$nulls":5},{"$f":"IF(BV188=\"\",\"\",_xlfn.NORM.DIST(BV188,AVERAGE(BV188:BW5178),Dashboard!$L$36,FALSE))","v":""}]
[{"$nulls":49},"",{"$nulls":11},"",{"$nulls":11},"",{"$nulls":4},"",null,{"$f":"IF(BV189=\"\",\"\",AVERAGE($BV$10:BV189))","v":""},null,{"$f":"IF(BV189=\"\",\"\",_xlfn.NORM.DIST(BV189,AVERAGE($BV$10:$BV$5000),Dashboard!$L$36,FALSE))","v":""},{"$nulls":5},{"$f":"IF(BV189=\"\",\"\",_xlfn.NORM.DIST(BV189,AVERAGE(BV189:BW5179),Dashboard!$L$36,FALSE))","v":""}]
[{"$nulls":49},"",{"$nulls":11},"",{"$nulls":11},"",{"$nulls":4},"",null,{"$f":"IF(BV190=\"\",\"\",AVERAGE($BV$10:BV190))","v":""},null,{"$f":"IF(BV190=\"\",\"\",_xlfn.NORM.DIST(BV190,AVERAGE($BV$10:$BV$5000),Dashboard!$L$36,FALSE))","v":""},{"$nulls":5},{"$f":"IF(BV190=\"\",\"\",_xlfn.NORM.DIST(BV190,AVERAGE(BV190:BW5180),Dashboard!$L$36,FALSE))","v":""}]
[{"$nulls":49},"",{"$nulls":11},"",{"$nulls":11},"",{"$nulls":4},"",null,{"$f":"IF(BV191=\"\",\"\",AVERAGE($BV$10:BV191))","v":""},null,{"$f":"IF(BV191=\"\",\"\",_xlfn.NORM.DIST(BV191,AVERAGE($BV$10:$BV$5000),Dashboard!$L$36,FALSE))","v":""},{"$nulls":5},{"$f":"IF(BV191=\"\",\"\",_xlfn.NORM.DIST(BV191,AVERAGE(BV191:BW5181),Dashboard!$L$36,FALSE))","v":""}]
[{"$nulls":49},"",{"$nulls":11},"",{"$nulls":11},"",{"$nulls":4},"",null,{"$f":"IF(BV192=\"\",\"\",AVERAGE($BV$10:BV192))","v":""},null,{"$f":"IF(BV192=\"\",\"\",_xlfn.NORM.DIST(BV192,AVERAGE($BV$10:$BV$5000),Dashboard!$L$36,FALSE))","v":""},{"$nulls":5},{"$f":"IF(BV192=\"\",\"\",_xlfn.NORM.DIST(BV192,AVERAGE(BV192:BW5182),Dashboard!$L$36,FALSE))","v":""}]
[{"$nulls":49},"",{"$nulls":11},"",{"$nulls":11},"",{"$nulls":4},"",null,{"$f":"IF(BV193=\"\",\"\",AVERAGE($BV$10:BV193))","v":""},null,{"$f":"IF(BV193=\"\",\"\",_xlfn.NORM.DIST(BV193,AVERAGE($BV$10:$BV$5000),Dashboard!$L$36,FALSE))","v":""},{"$nulls":5},{"$f":"IF(BV193=\"\",\"\",_xlfn.NORM.DIST(BV193,AVERAGE(BV193:BW5183),Dashboard!$L$36,FALSE))","v":""}]
[{"$nulls":49},"",{"$nulls":11},"",{"$nulls":11},"",{"$nulls":4},"",null,{"$f":"IF(BV194=\"\",\"\",AVERAGE($BV$10:BV194))","v":""},null,{"$f":"IF(BV194=\"\",\"\",_xlfn.NORM.DIST(BV194,AVERAGE($BV$10:$BV$5000),Dashboard!$L$36,FALSE))","v":""},{"$nulls":5},{"$f":"IF(BV194=\"\",\"\",_xlfn.NORM.DIST(BV194,AVERAGE(BV194:BW5184),Dashboard!$L$36,FALSE))","v":""}]
[{"$nulls":49},"",{"$nulls":11},"",{"$nulls":11},"",{"$nulls":4},"",null,{"$f":"IF(BV195=\"\",\"\",AVERAGE($BV$10:BV195))","v":""},null,{"$f":"IF(BV195=\"\",\"\",_xlfn.NORM.DIST(BV195,AVERAGE($BV$10:$BV$5000),Dashboard!$L$36,FALSE))","v":""},{"$nulls":5},{"$f":"IF(BV195=\"\",\"\",_xlfn.NORM.DIST(BV195,AVERAGE(BV195:BW5185),Dashboard!$L$36,FALSE))","v":""}]
[{"$nulls":49},"",{"$nulls":11},"",{"$nulls":11},"",{"$nulls":4},"",null,{"$f":"IF(BV196=\"\",\"\",AVERAGE($BV$10:BV196))","v":""},null,{"$f":"IF(BV196=\"\",\"\",_xlfn.NORM.DIST(BV196,AVERAGE($BV$10:$BV$5000),Dashboard!$L$36,FALSE))","v":""},{"$nulls":5},{"$f":"IF(BV196=\"\",\"\",_xlfn.NORM.DIST(BV196,AVERAGE(BV196:BW5186),Dashboard!$L$36,FALSE))","v":""}]
[{"$nulls":49},"",{"$nulls":11},"",{"$nulls":11},"",{"$nulls":4},"",null,{"$f":"IF(BV197=\"\",\"\",AVERAGE($BV$10:BV197))","v":""},null,{"$f":"IF(BV197=\"\",\"\",_xlfn.NORM.DIST(BV197,AVERAGE($BV$10:$BV$5000),Dashboard!$L$36,FALSE))","v":""},{"$nulls":5},{"$f":"IF(BV197=\"\",\"\",_xlfn.NORM.DIST(BV197,AVERAGE(BV197:BW5187),Dashboard!$L$36,FALSE))","v":""}]
[{"$nulls":49},"",{"$nulls":11},"",{"$nulls":11},"",{"$nulls":4},"",null,{"$f":"IF(BV198=\"\",\"\",AVERAGE($BV$10:BV198))","v":""},null,{"$f":"IF(BV198=\"\",\"\",_xlfn.NORM.DIST(BV198,AVERAGE($BV$10:$BV$5000),Dashboard!$L$36,FALSE))","v":""},{"$nulls":5},{"$f":"IF(BV198=\"\",\"\",_xlfn.NORM.DIST(BV198,AVERAGE(BV198:BW5188),Dashboard!$L$36,FALSE))","v":""}]
[{"$nulls":49},"",{"$nulls":11},"",{"$nulls":11},"",{"$nulls":4},"",null,{"$f":"IF(BV199=\"\",\"\",AVERAGE($BV$10:BV199))","v":""},null,{"$f":"IF(BV199=\"\",\"\",_xlfn.NORM.DIST(BV199,AVERAGE($BV$10:$BV$5000),Dashboard!$L$36,FALSE))","v":""},{"$nulls":5},{"$f":"IF(BV199=\"\",\"\",_xlfn.NORM.DIST(BV199,AVERAGE(BV199:BW5189),Dashboard!$L$36,FALSE))","v":""}]
[{"$nulls":49},"",{"$nulls":11},"",{"$nulls":11},"",{"$nulls":4},"",null,{"$f":"IF(BV200=\"\",\"\",AVERAGE($BV$10:BV200))","v":""},null,{"$f":"IF(BV200=\"\",\"\",_xlfn.NORM.DIST(BV200,AVERAGE($BV$10:$BV$5000),Dashboard!$L$36,FALSE))","v":""},{"$nulls":5},{"$f":"IF(BV200=\"\",\"\",_xlfn.NORM.DIST(BV200,AVERAGE(BV200:BW5190),Dashboard!$L$36,FALSE))","v":""}]
[{"$nulls":49},"",{"$nulls":11},"",{"$nulls":11},"",{"$nulls":4},"",null,{"$f":"IF(BV201=\"\",\"\",AVERAGE($BV$10:BV201))","v":""},null,{"$f":"IF(BV201=\"\",\"\",_xlfn.NORM.DIST(BV201,AVERAGE($BV$10:$BV$5000),Dashboard!$L$36,FALSE))","v":""},{"$nulls":5},{"$f":"IF(BV201=\"\",\"\",_xlfn.NORM.DIST(BV201,AVERAGE(BV201:BW5191),Dashboard!$L$36,FALSE))","v":""}]
[{"$nulls":49},"",{"$nulls":11},"",{"$nulls":11},"",{"$nulls":4},"",null,{"$f":"IF(BV202=\"\",\"\",AVERAGE($BV$10:BV202))","v":""},null,{"$f":"IF(BV202=\"\",\"\",_xlfn.NORM.DIST(BV202,AVERAGE($BV$10:$BV$5000),Dashboard!$L$36,FALSE))","v":""},{"$nulls":5},{"$f":"IF(BV202=\"\",\"\",_xlfn.NORM.DIST(BV202,AVERAGE(BV202:BW5192),Dashboard!$L$36,FALSE))","v":""}]
[{"$nulls":49},"",{"$nulls":11},"",{"$nulls":11},"",{"$nulls":4},"",null,{"$f":"IF(BV203=\"\",\"\",AVERAGE($BV$10:BV203))","v":""},null,{"$f":"IF(BV203=\"\",\"\",_xlfn.NORM.DIST(BV203,AVERAGE($BV$10:$BV$5000),Dashboard!$L$36,FALSE))","v":""},{"$nulls":5},{"$f":"IF(BV203=\"\",\"\",_xlfn.NORM.DIST(BV203,AVERAGE(BV203:BW5193),Dashboard!$L$36,FALSE))","v":""}]
[{"$nulls":49},"",{"$nulls":11},"",{"$nulls":11},"",{"$nulls":4},"",null,{"$f":"IF(BV204=\"\",\"\",AVERAGE($BV$10:BV204))","v":""},null,{"$f":"IF(BV204=\"\",\"\",_xlfn.NORM.DIST(BV204,AVERAGE($BV$10:$BV$5000),Dashboard!$L$36,FALSE))","v":""},{"$nulls":5},{"$f":"IF(BV204=\"\",\"\",_xlfn.NORM.DIST(BV204,AVERAGE(BV204:BW5194),Dashboard!$L$36,FALSE))","v":""}]
[{"$nulls":49},"",{"$nulls":11},"",{"$nulls":11},"",{"$nulls":4},"",null,{"$f":"IF(BV205=\"\",\"\",AVERAGE($BV$10:BV205))","v":""},null,{"$f":"IF(BV205=\"\",\"\",_xlfn.NORM.DIST(BV205,AVERAGE($BV$10:$BV$5000),Dashboard!$L$36,FALSE))","v":""},{"$nulls":5},{"$f":"IF(BV205=\"\",\"\",_xlfn.NORM.DIST(BV205,AVERAGE(BV205:BW5195),Dashboard!$L$36,FALSE))","v":""}]
[{"$nulls":49},"",{"$nulls":11},"",{"$nulls":11},"",{"$nulls":4},"",null,{"$f":"IF(BV206=\"\",\"\",AVERAGE($BV$10:BV206))","v":""},null,{"$f":"IF(BV206=\"\",\"\",_xlfn.NORM.DIST(BV206,AVERAGE($BV$10:$BV$5000),Dashboard!$L$36,FALSE))","v":""},{"$nulls":5},{"$f":"IF(BV206=\"\",\"\",_xlfn.NORM.DIST(BV206,AVERAGE(BV206:BW5196),Dashboard!$L$36,FALSE))","v":""}]
[{"$nulls":49},"",{"$nulls":11},"",{"$nulls":11},"",{"$nulls":4},"",null,{"$f":"IF(BV207=\"\",\"\",AVERAGE($BV$10:BV207))","v":""},null,{"$f":"IF(BV207=\"\",\"\",_xlfn.NORM.DIST(BV207,AVERAGE($BV$10:$BV$5000),Dashboard!$L$36,FALSE))","v":""},{"$nulls":5},{"$f":"IF(BV207=\"\",\"\",_xlfn.NORM.DIST(BV207,AVERAGE(BV207:BW5197),Dashboard!$L$36,FALSE))","v":""}]
[{"$nulls":49},"",{"$nulls":11},"",{"$nulls":11},"",{"$nulls":4},"",null,{"$f":"IF(BV208=\"\",\"\",AVERAGE($BV$10:BV208))","v":""},null,{"$f":"IF(BV208=\"\",\"\",_xlfn.NORM.DIST(BV208,AVERAGE($BV$10:$BV$5000),Dashboard!$L$36,FALSE))","v":""},{"$nulls":5},{"$f":"IF(BV208=\"\",\"\",_xlfn.NORM.DIST(BV208,AVERAGE(BV208:BW5198),Dashboard!$L$36,FALSE))","v":""}]
[{"$nulls":49},"",{"$nulls":11},"",{"$nulls":11},"",{"$nulls":4},"",null,{"$f":"IF(BV209=\"\",\"\",AVERAGE($BV$10:BV209))","v":""},null,{"$f":"IF(BV209=\"\",\"\",_xlfn.NORM.DIST(BV209,AVERAGE($BV$10:$BV$5000),Dashboard!$L$36,FALSE))","v":""},{"$nulls":5},{"$f":"IF(BV209=\"\",\"\",_xlfn.NORM.DIST(BV209,AVERAGE(BV209:BW5199),Dashboard!$L$36,FALSE))","v":""}]
[{"$nulls":49},"",{"$nulls":11},"",{"$nulls":11},"",{"$nulls":4},"",null,{"$f":"IF(BV210=\"\",\"\",AVERAGE($BV$10:BV210))","v":""},null,{"$f":"IF(BV210=\"\",\"\",_xlfn.NORM.DIST(BV210,AVERAGE($BV$10:$BV$5000),Dashboard!$L$36,FALSE))","v":""},{"$nulls":5},{"$f":"IF(BV210=\"\",\"\",_xlfn.NORM.DIST(BV210,AVERAGE(BV210:BW5200),Dashboard!$L$36,FALSE))","v":""}]
[{"$nulls":49},"",{"$nulls":11},"",{"$nulls":11},"",{"$nulls":4},"",null,{"$f":"IF(BV211=\"\",\"\",AVERAGE($BV$10:BV211))","v":""},null,{"$f":"IF(BV211=\"\",\"\",_xlfn.NORM.DIST(BV211,AVERAGE($BV$10:$BV$5000),Dashboard!$L$36,FALSE))","v":""},{"$nulls":5},{"$f":"IF(BV211=\"\",\"\",_xlfn.NORM.DIST(BV211,AVERAGE(BV211:BW5201),Dashboard!$L$36,FALSE))","v":""}]
[{"$nulls":49},"",{"$nulls":11},"",{"$nulls":11},"",{"$nulls":4},"",null,{"$f":"IF(BV212=\"\",\"\",AVERAGE($BV$10:BV212))","v":""},null,{"$f":"IF(BV212=\"\",\"\",_xlfn.NORM.DIST(BV212,AVERAGE($BV$10:$BV$5000),Dashboard!$L$36,FALSE))","v":""},{"$nulls":5},{"$f":"IF(BV212=\"\",\"\",_xlfn.NORM.DIST(BV212,AVERAGE(BV212:BW5202),Dashboard!$L$36,FALSE))","v":""}]
[{"$nulls":49},{"$f":"IF(SUM(AR213:AW213)=0,\"\",AVERAGE(AR213:AW213))","v":""},{"$nulls":11},{"$f":"IF(SUM(BD213:BI213)=0,\"\",AVERAGE(BD213:BI213))","v":""},{"$nulls":11},{"$f":"IF(SUM(BP213:BU213)=0,\"\",AVERAGE(BP213:BU213))","v":""},{"$nulls":4},{"$f":"IF(BV213=\"\",\"\",BV213-AJ213)","v":""},null,{"$f":"IF(BV213=\"\",\"\",AVERAGE($BV$10:BV213))","v":""},null,{"$f":"IF(BV213=\"\",\"\",_xlfn.NORM.DIST(BV213,AVERAGE($BV$10:$BV$5000),Dashboard!$L$36,FALSE))","v":""},{"$nulls":5},{"$f":"IF(BV213=\"\",\"\",_xlfn.NORM.DIST(BV213,AVERAGE(BV213:BW5203),Dashboard!$L$36,FALSE))","v":""}]
[{"$nulls":49},"",{"$nulls":11},"",{"$nulls":11},"",{"$nulls":4},"",null,{"$f":"IF(BV214=\"\",\"\",AVERAGE($BV$10:BV214))","v":""},null,{"$f":"IF(BV214=\"\",\"\",_xlfn.NORM.DIST(BV214,AVERAGE($BV$10:$BV$5000),Dashboard!$L$36,FALSE))","v":""},{"$nulls":5},{"$f":"IF(BV214=\"\",\"\",_xlfn.NORM.DIST(BV214,AVERAGE(BV214:BW5204),Dashboard!$L$36,FALSE))","v":""}]
[{"$nulls":49},"",{"$nulls":11},"",{"$nulls":11},"",{"$nulls":4},"",null,{"$f":"IF(BV215=\"\",\"\",AVERAGE($BV$10:BV215))","v":""},null,{"$f":"IF(BV215=\"\",\"\",_xlfn.NORM.DIST(BV215,AVERAGE($BV$10:$BV$5000),Dashboard!$L$36,FALSE))","v":""},{"$nulls":5},{"$f":"IF(BV215=\"\",\"\",_xlfn.NORM.DIST(BV215,AVERAGE(BV215:BW5205),Dashboard!$L$36,FALSE))","v":""}]
[{"$nulls":49},"",{"$nulls":11},"",{"$nulls":11},"",{"$nulls":4},"",null,{"$f":"IF(BV216=\"\",\"\",AVERAGE($BV$10:BV216))","v":""},null,{"$f":"IF(BV216=\"\",\"\",_xlfn.NORM.DIST(BV216,AVERAGE($BV$10:$BV$5000),Dashboard!$L$36,FALSE))","v":""},{"$nulls":5},{"$f":"IF(BV216=\"\",\"\",_xlfn.NORM.DIST(BV216,AVERAGE(BV216:BW5206),Dashboard!$L$36,FALSE))","v":""}]
[{"$nulls":49},"",{"$nulls":11},"",{"$nulls":11},"",{"$nulls":4},"",null,{"$f":"IF(BV217=\"\",\"\",AVERAGE($BV$10:BV217))","v":""},null,{"$f":"IF(BV217=\"\",\"\",_xlfn.NORM.DIST(BV217,AVERAGE($BV$10:$BV$5000),Dashboard!$L$36,FALSE))","v":""},{"$nulls":5},{"$f":"IF(BV217=\"\",\"\",_xlfn.NORM.DIST(BV217,AVERAGE(BV217:BW5207),Dashboard!$L$36,FALSE))","v":""}]
[{"$nulls":49},"",{"$nulls":11},"",{"$nulls":11},"",{"$nulls":4},"",null,{"$f":"IF(BV218=\"\",\"\",AVERAGE($BV$10:BV218))","v":""},null,{"$f":"IF(BV218=\"\",\"\",_xlfn.NORM.DIST(BV218,AVERAGE($BV$10:$BV$5000),Dashboard!$L$36,FALSE))","v":""},{"$nulls":5},{"$f":"IF(BV218=\"\",\"\",_xlfn.NORM.DIST(BV218,AVERAGE(BV218:BW5208),Dashboard!$L$36,FALSE))","v":""}]
[{"$nulls":49},"",{"$nulls":11},"",{"$nulls":11},"",{"$nulls":4},"",null,{"$f":"IF(BV219=\"\",\"\",AVERAGE($BV$10:BV219))","v":""},null,{"$f":"IF(BV219=\"\",\"\",_xlfn.NORM.DIST(BV219,AVERAGE($BV$10:$BV$5000),Dashboard!$L$36,FALSE))","v":""},{"$nulls":5},{"$f":"IF(BV219=\"\",\"\",_xlfn.NORM.DIST(BV219,AVERAGE(BV219:BW5209),Dashboard!$L$36,FALSE))","v":""}]
[{"$nulls":49},"",{"$nulls":11},"",{"$nulls":11},"",{"$nulls":4},"",null,{"$f":"IF(BV220=\"\",\"\",AVERAGE($BV$10:BV220))","v":""},null,{"$f":"IF(BV220=\"\",\"\",_xlfn.NORM.DIST(BV220,AVERAGE($BV$10:$BV$5000),Dashboard!$L$36,FALSE))","v":""},{"$nulls":5},{"$f":"IF(BV220=\"\",\"\",_xlfn.NORM.DIST(BV220,AVERAGE(BV220:BW5210),Dashboard!$L$36,FALSE))","v":""}]
[{"$nulls":49},"",{"$nulls":11},"",{"$nulls":11},"",{"$nulls":4},"",null,{"$f":"IF(BV221=\"\",\"\",AVERAGE($BV$10:BV221))","v":""},null,{"$f":"IF(BV221=\"\",\"\",_xlfn.NORM.DIST(BV221,AVERAGE($BV$10:$BV$5000),Dashboard!$L$36,FALSE))","v":""},{"$nulls":5},{"$f":"IF(BV221=\"\",\"\",_xlfn.NORM.DIST(BV221,AVERAGE(BV221:BW5211),Dashboard!$L$36,FALSE))","v":""}]
[{"$nulls":49},"",{"$nulls":11},"",{"$nulls":11},"",{"$nulls":4},"",null,{"$f":"IF(BV222=\"\",\"\",AVERAGE($BV$10:BV222))","v":""},null,{"$f":"IF(BV222=\"\",\"\",_xlfn.NORM.DIST(BV222,AVERAGE($BV$10:$BV$5000),Dashboard!$L$36,FALSE))","v":""},{"$nulls":5},{"$f":"IF(BV222=\"\",\"\",_xlfn.NORM.DIST(BV222,AVERAGE(BV222:BW5212),Dashboard!$L$36,FALSE))","v":""}]
[{"$nulls":49},"",{"$nulls":11},"",{"$nulls":11},"",{"$nulls":4},"",null,{"$f":"IF(BV223=\"\",\"\",AVERAGE($BV$10:BV223))","v":""},null,{"$f":"IF(BV223=\"\",\"\",_xlfn.NORM.DIST(BV223,AVERAGE($BV$10:$BV$5000),Dashboard!$L$36,FALSE))","v":""},{"$nulls":5},{"$f":"IF(BV223=\"\",\"\",_xlfn.NORM.DIST(BV223,AVERAGE(BV223:BW5213),Dashboard!$L$36,FALSE))","v":""}]
[{"$nulls":49},"",{"$nulls":11},"",{"$nulls":11},"",{"$nulls":4},"",null,{"$f":"IF(BV224=\"\",\"\",AVERAGE($BV$10:BV224))","v":""},null,{"$f":"IF(BV224=\"\",\"\",_xlfn.NORM.DIST(BV224,AVERAGE($BV$10:$BV$5000),Dashboard!$L$36,FALSE))","v":""},{"$nulls":5},{"$f":"IF(BV224=\"\",\"\",_xlfn.NORM.DIST(BV224,AVERAGE(BV224:BW5214),Dashboard!$L$36,FALSE))","v":""}]
[{"$nulls":49},"",{"$nulls":11},"",{"$nulls":11},"",{"$nulls":4},"",null,{"$f":"IF(BV225=\"\",\"\",AVERAGE($BV$10:BV225))","v":""},null,{"$f":"IF(BV225=\"\",\"\",_xlfn.NORM.DIST(BV225,AVERAGE($BV$10:$BV$5000),Dashboard!$L$36,FALSE))","v":""},{"$nulls":5},{"$f":"IF(BV225=\"\",\"\",_xlfn.NORM.DIST(BV225,AVERAGE(BV225:BW5215),Dashboard!$L$36,FALSE))","v":""}]
[{"$nulls":49},"",{"$nulls":11},"",{"$nulls":11},"",{"$nulls":4},"",null,{"$f":"IF(BV226=\"\",\"\",AVERAGE($BV$10:BV226))","v":""},null,{"$f":"IF(BV226=\"\",\"\",_xlfn.NORM.DIST(BV226,AVERAGE($BV$10:$BV$5000),Dashboard!$L$36,FALSE))","v":""},{"$nulls":5},{"$f":"IF(BV226=\"\",\"\",_xlfn.NORM.DIST(BV226,AVERAGE(BV226:BW5216),Dashboard!$L$36,FALSE))","v":""}]
[{"$nulls":49},"",{"$nulls":11},"",{"$nulls":11},"",{"$nulls":4},"",null,{"$f":"IF(BV227=\"\",\"\",AVERAGE($BV$10:BV227))","v":""},null,{"$f":"IF(BV227=\"\",\"\",_xlfn.NORM.DIST(BV227,AVERAGE($BV$10:$BV$5000),Dashboard!$L$36,FALSE))","v":""},{"$nulls":5},{"$f":"IF(BV227=\"\",\"\",_xlfn.NORM.DIST(BV227,AVERAGE(BV227:BW5217),Dashboard!$L$36,FALSE))","v":""}]
[{"$nulls":49},"",{"$nulls":11},"",{"$nulls":11},"",{"$nulls":4},"",null,{"$f":"IF(BV228=\"\",\"\",AVERAGE($BV$10:BV228))","v":""},null,{"$f":"IF(BV228=\"\",\"\",_xlfn.NORM.DIST(BV228,AVERAGE($BV$10:$BV$5000),Dashboard!$L$36,FALSE))","v":""},{"$nulls":5},{"$f":"IF(BV228=\"\",\"\",_xlfn.NORM.DIST(BV228,AVERAGE(BV228:BW5218),Dashboard!$L$36,FALSE))","v":""}]
[{"$nulls":49},"",{"$nulls":11},"",{"$nulls":11},"",{"$nulls":4},"",null,{"$f":"IF(BV229=\"\",\"\",AVERAGE($BV$10:BV229))","v":""},null,{"$f":"IF(BV229=\"\",\"\",_xlfn.NORM.DIST(BV229,AVERAGE($BV$10:$BV$5000),Dashboard!$L$36,FALSE))","v":""},{"$nulls":5},{"$f":"IF(BV229=\"\",\"\",_xlfn.NORM.DIST(BV229,AVERAGE(BV229:BW5219),Dashboard!$L$36,FALSE))","v":""}]
[{"$nulls":49},"",{"$nulls":11},"",{"$nulls":11},"",{"$nulls":4},"",null,{"$f":"IF(BV230=\"\",\"\",AVERAGE($BV$10:BV230))","v":""},null,{"$f":"IF(BV230=\"\",\"\",_xlfn.NORM.DIST(BV230,AVERAGE($BV$10:$BV$5000),Dashboard!$L$36,FALSE))","v":""},{"$nulls":5},{"$f":"IF(BV230=\"\",\"\",_xlfn.NORM.DIST(BV230,AVERAGE(BV230:BW5220),Dashboard!$L$36,FALSE))","v":""}]
[{"$nulls":49},"",{"$nulls":11},"",{"$nulls":11},"",{"$nulls":4},"",null,{"$f":"IF(BV231=\"\",\"\",AVERAGE($BV$10:BV231))","v":""},null,{"$f":"IF(BV231=\"\",\"\",_xlfn.NORM.DIST(BV231,AVERAGE($BV$10:$BV$5000),Dashboard!$L$36,FALSE))","v":""},{"$nulls":5},{"$f":"IF(BV231=\"\",\"\",_xlfn.NORM.DIST(BV231,AVERAGE(BV231:BW5221),Dashboard!$L$36,FALSE))","v":""}]
[{"$nulls":49},"",{"$nulls":11},"",{"$nulls":11},"",{"$nulls":4},"",null,{"$f":"IF(BV232=\"\",\"\",AVERAGE($BV$10:BV232))","v":""},null,{"$f":"IF(BV232=\"\",\"\",_xlfn.NORM.DIST(BV232,AVERAGE($BV$10:$BV$5000),Dashboard!$L$36,FALSE))","v":""},{"$nulls":5},{"$f":"IF(BV232=\"\",\"\",_xlfn.NORM.DIST(BV232,AVERAGE(BV232:BW5222),Dashboard!$L$36,FALSE))","v":""}]
[{"$nulls":49},"",{"$nulls":11},"",{"$nulls":11},"",{"$nulls":4},"",null,{"$f":"IF(BV233=\"\",\"\",AVERAGE($BV$10:BV233))","v":""},null,{"$f":"IF(BV233=\"\",\"\",_xlfn.NORM.DIST(BV233,AVERAGE($BV$10:$BV$5000),Dashboard!$L$36,FALSE))","v":""},{"$nulls":5},{"$f":"IF(BV233=\"\",\"\",_xlfn.NORM.DIST(BV233,AVERAGE(BV233:BW5223),Dashboard!$L$36,FALSE))","v":""}]
[{"$nulls":49},"",{"$nulls":11},"",{"$nulls":11},"",{"$nulls":4},"",null,{"$f":"IF(BV234=\"\",\"\",AVERAGE($BV$10:BV234))","v":""},null,{"$f":"IF(BV234=\"\",\"\",_xlfn.NORM.DIST(BV234,AVERAGE($BV$10:$BV$5000),Dashboard!$L$36,FALSE))","v":""},{"$nulls":5},{"$f":"IF(BV234=\"\",\"\",_xlfn.NORM.DIST(BV234,AVERAGE(BV234:BW5224),Dashboard!$L$36,FALSE))","v":""}]
[{"$nulls":49},"",{"$nulls":11},"",{"$nulls":11},"",{"$nulls":4},"",null,{"$f":"IF(BV235=\"\",\"\",AVERAGE($BV$10:BV235))","v":""},null,{"$f":"IF(BV235=\"\",\"\",_xlfn.NORM.DIST(BV235,AVERAGE($BV$10:$BV$5000),Dashboard!$L$36,FALSE))","v":""},{"$nulls":5},{"$f":"IF(BV235=\"\",\"\",_xlfn.NORM.DIST(BV235,AVERAGE(BV235:BW5225),Dashboard!$L$36,FALSE))","v":""}]
[{"$nulls":49},"",{"$nulls":11},"",{"$nulls":11},"",{"$nulls":4},"",null,{"$f":"IF(BV236=\"\",\"\",AVERAGE($BV$10:BV236))","v":""},null,{"$f":"IF(BV236=\"\",\"\",_xlfn.NORM.DIST(BV236,AVERAGE($BV$10:$BV$5000),Dashboard!$L$36,FALSE))","v":""},{"$nulls":5},{"$f":"IF(BV236=\"\",\"\",_xlfn.NORM.DIST(BV236,AVERAGE(BV236:BW5226),Dashboard!$L$36,FALSE))","v":""}]
[{"$nulls":49},"",{"$nulls":11},"",{"$nulls":11},"",{"$nulls":4},"",null,{"$f":"IF(BV237=\"\",\"\",AVERAGE($BV$10:BV237))","v":""},null,{"$f":"IF(BV237=\"\",\"\",_xlfn.NORM.DIST(BV237,AVERAGE($BV$10:$BV$5000),Dashboard!$L$36,FALSE))","v":""},{"$nulls":5},{"$f":"IF(BV237=\"\",\"\",_xlfn.NORM.DIST(BV237,AVERAGE(BV237:BW5227),Dashboard!$L$36,FALSE))","v":""}]
[{"$nulls":49},"",{"$nulls":11},"",{"$nulls":11},"",{"$nulls":4},"",null,{"$f":"IF(BV238=\"\",\"\",AVERAGE($BV$10:BV238))","v":""},null,{"$f":"IF(BV238=\"\",\"\",_xlfn.NORM.DIST(BV238,AVERAGE($BV$10:$BV$5000),Dashboard!$L$36,FALSE))","v":""},{"$nulls":5},{"$f":"IF(BV238=\"\",\"\",_xlfn.NORM.DIST(BV238,AVERAGE(BV238:BW5228),Dashboard!$L$36,FALSE))","v":""}]
[{"$nulls":49},"",{"$nulls":11},"",{"$nulls":11},"",{"$nulls":4},"",null,{"$f":"IF(BV239=\"\",\"\",AVERAGE($BV$10:BV239))","v":""},null,{"$f":"IF(BV239=\"\",\"\",_xlfn.NORM.DIST(BV239,AVERAGE($BV$10:$BV$5000),Dashboard!$L$36,FALSE))","v":""},{"$nulls":5},{"$f":"IF(BV239=\"\",\"\",_xlfn.NORM.DIST(BV239,AVERAGE(BV239:BW5229),Dashboard!$L$36,FALSE))","v":""}]
[{"$nulls":49},"",{"$nulls":11},"",{"$nulls":11},"",{"$nulls":4},"",null,{"$f":"IF(BV240=\"\",\"\",AVERAGE($BV$10:BV240))","v":""},null,{"$f":"IF(BV240=\"\",\"\",_xlfn.NORM.DIST(BV240,AVERAGE($BV$10:$BV$5000),Dashboard!$L$36,FALSE))","v":""},{"$nulls":5},{"$f":"IF(BV240=\"\",\"\",_xlfn.NORM.DIST(BV240,AVERAGE(BV240:BW5230),Dashboard!$L$36,FALSE))","v":""}]
[{"$nulls":49},"",{"$nulls":11},"",{"$nulls":11},"",{"$nulls":4},"",null,{"$f":"IF(BV241=\"\",\"\",AVERAGE($BV$10:BV241))","v":""},null,{"$f":"IF(BV241=\"\",\"\",_xlfn.NORM.DIST(BV241,AVERAGE($BV$10:$BV$5000),Dashboard!$L$36,FALSE))","v":""},{"$nulls":5},{"$f":"IF(BV241=\"\",\"\",_xlfn.NORM.DIST(BV241,AVERAGE(BV241:BW5231),Dashboard!$L$36,FALSE))","v":""}]
[{"$nulls":49},"",{"$nulls":11},"",{"$nulls":11},"",{"$nulls":4},"",null,{"$f":"IF(BV242=\"\",\"\",AVERAGE($BV$10:BV242))","v":""},null,{"$f":"IF(BV242=\"\",\"\",_xlfn.NORM.DIST(BV242,AVERAGE($BV$10:$BV$5000),Dashboard!$L$36,FALSE))","v":""},{"$nulls":5},{"$f":"IF(BV242=\"\",\"\",_xlfn.NORM.DIST(BV242,AVERAGE(BV242:BW5232),Dashboard!$L$36,FALSE))","v":""}]
[{"$nulls":49},"",{"$nulls":11},"",{"$nulls":11},"",{"$nulls":4},"",null,{"$f":"IF(BV243=\"\",\"\",AVERAGE($BV$10:BV243))","v":""},null,{"$f":"IF(BV243=\"\",\"\",_xlfn.NORM.DIST(BV243,AVERAGE($BV$10:$BV$5000),Dashboard!$L$36,FALSE))","v":""},{"$nulls":5},{"$f":"IF(BV243=\"\",\"\",_xlfn.NORM.DIST(BV243,AVERAGE(BV243:BW5233),Dashboard!$L$36,FALSE))","v":""}]
[{"$nulls":49},"",{"$nulls":11},"",{"$nulls":11},"",{"$nulls":4},"",null,{"$f":"IF(BV244=\"\",\"\",AVERAGE($BV$10:BV244))","v":""},null,{"$f":"IF(BV244=\"\",\"\",_xlfn.NORM.DIST(BV244,AVERAGE($BV$10:$BV$5000),Dashboard!$L$36,FALSE))","v":""},{"$nulls":5},{"$f":"IF(BV244=\"\",\"\",_xlfn.NORM.DIST(BV244,AVERAGE(BV244:BW5234),Dashboard!$L$36,FALSE))","v":""}]
[{"$nulls":49},"",{"$nulls":11},"",{"$nulls":11},"",{"$nulls":4},"",null,{"$f":"IF(BV245=\"\",\"\",AVERAGE($BV$10:BV245))","v":""},null,{"$f":"IF(BV245=\"\",\"\",_xlfn.NORM.DIST(BV245,AVERAGE($BV$10:$BV$5000),Dashboard!$L$36,FALSE))","v":""},{"$nulls":5},{"$f":"IF(BV245=\"\",\"\",_xlfn.NORM.DIST(BV245,AVERAGE(BV245:BW5235),Dashboard!$L$36,FALSE))","v":""}]
[{"$nulls":49},"",{"$nulls":11},"",{"$nulls":11},"",{"$nulls":4},"",null,{"$f":"IF(BV246=\"\",\"\",AVERAGE($BV$10:BV246))","v":""},null,{"$f":"IF(BV246=\"\",\"\",_xlfn.NORM.DIST(BV246,AVERAGE($BV$10:$BV$5000),Dashboard!$L$36,FALSE))","v":""},{"$nulls":5},{"$f":"IF(BV246=\"\",\"\",_xlfn.NORM.DIST(BV246,AVERAGE(BV246:BW5236),Dashboard!$L$36,FALSE))","v":""}]
[{"$nulls":49},"",{"$nulls":11},"",{"$nulls":11},"",{"$nulls":4},"",null,{"$f":"IF(BV247=\"\",\"\",AVERAGE($BV$10:BV247))","v":""},null,{"$f":"IF(BV247=\"\",\"\",_xlfn.NORM.DIST(BV247,AVERAGE($BV$10:$BV$5000),Dashboard!$L$36,FALSE))","v":""},{"$nulls":5},{"$f":"IF(BV247=\"\",\"\",_xlfn.NORM.DIST(BV247,AVERAGE(BV247:BW5237),Dashboard!$L$36,FALSE))","v":""}]
[{"$nulls":49},"",{"$nulls":11},"",{"$nulls":11},"",{"$nulls":4},"",null,{"$f":"IF(BV248=\"\",\"\",AVERAGE($BV$10:BV248))","v":""},null,{"$f":"IF(BV248=\"\",\"\",_xlfn.NORM.DIST(BV248,AVERAGE($BV$10:$BV$5000),Dashboard!$L$36,FALSE))","v":""},{"$nulls":5},{"$f":"IF(BV248=\"\",\"\",_xlfn.NORM.DIST(BV248,AVERAGE(BV248:BW5238),Dashboard!$L$36,FALSE))","v":""}]
[{"$nulls":49},"",{"$nulls":11},"",{"$nulls":11},"",{"$nulls":4},"",null,{"$f":"IF(BV249=\"\",\"\",AVERAGE($BV$10:BV249))","v":""},null,{"$f":"IF(BV249=\"\",\"\",_xlfn.NORM.DIST(BV249,AVERAGE($BV$10:$BV$5000),Dashboard!$L$36,FALSE))","v":""},{"$nulls":5},{"$f":"IF(BV249=\"\",\"\",_xlfn.NORM.DIST(BV249,AVERAGE(BV249:BW5239),Dashboard!$L$36,FALSE))","v":""}]
[{"$nulls":49},"",{"$nulls":11},"",{"$nulls":11},"",{"$nulls":4},"",null,{"$f":"IF(BV250=\"\",\"\",AVERAGE($BV$10:BV250))","v":""},null,{"$f":"IF(BV250=\"\",\"\",_xlfn.NORM.DIST(BV250,AVERAGE($BV$10:$BV$5000),Dashboard!$L$36,FALSE))","v":""},{"$nulls":5},{"$f":"IF(BV250=\"\",\"\",_xlfn.NORM.DIST(BV250,AVERAGE(BV250:BW5240),Dashboard!$L$36,FALSE))","v":""}]
[{"$nulls":49},"",{"$nulls":11},"",{"$nulls":11},"",{"$nulls":4},"",null,{"$f":"IF(BV251=\"\",\"\",AVERAGE($BV$10:BV251))","v":""},null,{"$f":"IF(BV251=\"\",\"\",_xlfn.NORM.DIST(BV251,AVERAGE($BV$10:$BV$5000),Dashboard!$L$36,FALSE))","v":""},{"$nulls":5},{"$f":"IF(BV251=\"\",\"\",_xlfn.NORM.DIST(BV251,AVERAGE(BV251:BW5241),Dashboard!$L$36,FALSE))","v":""}]
[{"$nulls":49},"",{"$nulls":11},"",{"$nulls":11},"",{"$nulls":4},"",null,{"$f":"IF(BV252=\"\",\"\",AVERAGE($BV$10:BV252))","v":""},null,{"$f":"IF(BV252=\"\",\"\",_xlfn.NORM.DIST(BV252,AVERAGE($BV$10:$BV$5000),Dashboard!$L$36,FALSE))","v":""},{"$nulls":5},{"$f":"IF(BV252=\"\",\"\",_xlfn.NORM.DIST(BV252,AVERAGE(BV252:BW5242),Dashboard!$L$36,FALSE))","v":""}]
[{"$nulls":49},"",{"$nulls":11},"",{"$nulls":11},"",{"$nulls":4},"",null,{"$f":"IF(BV253=\"\",\"\",AVERAGE($BV$10:BV253))","v":""},null,{"$f":"IF(BV253=\"\",\"\",_xlfn.NORM.DIST(BV253,AVERAGE($BV$10:$BV$5000),Dashboard!$L$36,FALSE))","v":""},{"$nulls":5},{"$f":"IF(BV253=\"\",\"\",_xlfn.NORM.DIST(BV253,AVERAGE(BV253:BW5243),Dashboard!$L$36,FALSE))","v":""}]
[{"$nulls":49},"",{"$nulls":11},"",{"$nulls":11},"",{"$nulls":4},"",null,{"$f":"IF(BV254=\"\",\"\",AVERAGE($BV$10:BV254))","v":""},null,{"$f":"IF(BV254=\"\",\"\",_xlfn.NORM.DIST(BV254,AVERAGE($BV$10:$BV$5000),Dashboard!$L$36,FALSE))","v":""},{"$nulls":5},{"$f":"IF(BV254=\"\",\"\",_xlfn.NORM.DIST(BV254,AVERAGE(BV254:BW5244),Dashboard!$L$36,FALSE))","v":""}]
[{"$nulls":49},"",{"$nulls":11},"",{"$nulls":11},"",{"$nulls":4},"",null,{"$f":"IF(BV255=\"\",\"\",AVERAGE($BV$10:BV255))","v":""},null,{"$f":"IF(BV255=\"\",\"\",_xlfn.NORM.DIST(BV255,AVERAGE($BV$10:$BV$5000),Dashboard!$L$36,FALSE))","v":""},{"$nulls":5},{"$f":"IF(BV255=\"\",\"\",_xlfn.NORM.DIST(BV255,AVERAGE(BV255:BW5245),Dashboard!$L$36,FALSE))","v":""}]
[{"$nulls":49},"",{"$nulls":11},"",{"$nulls":11},"",{"$nulls":4},"",null,{"$f":"IF(BV256=\"\",\"\",AVERAGE($BV$10:BV256))","v":""},null,{"$f":"IF(BV256=\"\",\"\",_xlfn.NORM.DIST(BV256,AVERAGE($BV$10:$BV$5000),Dashboard!$L$36,FALSE))","v":""},{"$nulls":5},{"$f":"IF(BV256=\"\",\"\",_xlfn.NORM.DIST(BV256,AVERAGE(BV256:BW5246),Dashboard!$L$36,FALSE))","v":""}]
[{"$nulls":49},"",{"$nulls":11},"",{"$nulls":11},"",{"$nulls":4},"",null,{"$f":"IF(BV257=\"\",\"\",AVERAGE($BV$10:BV257))","v":""},null,{"$f":"IF(BV257=\"\",\"\",_xlfn.NORM.DIST(BV257,AVERAGE($BV$10:$BV$5000),Dashboard!$L$36,FALSE))","v":""},{"$nulls":5},{"$f":"IF(BV257=\"\",\"\",_xlfn.NORM.DIST(BV257,AVERAGE(BV257:BW5247),Dashboard!$L$36,FALSE))","v":""}]
[{"$nulls":49},"",{"$nulls":11},"",{"$nulls":11},"",{"$nulls":4},"",null,{"$f":"IF(BV258=\"\",\"\",AVERAGE($BV$10:BV258))","v":""},null,{"$f":"IF(BV258=\"\",\"\",_xlfn.NORM.DIST(BV258,AVERAGE($BV$10:$BV$5000),Dashboard!$L$36,FALSE))","v":""},{"$nulls":5},{"$f":"IF(BV258=\"\",\"\",_xlfn.NORM.DIST(BV258,AVERAGE(BV258:BW5248),Dashboard!$L$36,FALSE))","v":""}]
[{"$nulls":49},"",{"$nulls":11},"",{"$nulls":11},"",{"$nulls":4},"",null,{"$f":"IF(BV259=\"\",\"\",AVERAGE($BV$10:BV259))","v":""},null,{"$f":"IF(BV259=\"\",\"\",_xlfn.NORM.DIST(BV259,AVERAGE($BV$10:$BV$5000),Dashboard!$L$36,FALSE))","v":""},{"$nulls":5},{"$f":"IF(BV259=\"\",\"\",_xlfn.NORM.DIST(BV259,AVERAGE(BV259:BW5249),Dashboard!$L$36,FALSE))","v":""}]
[{"$nulls":49},"",{"$nulls":11},"",{"$nulls":11},"",{"$nulls":4},"",null,{"$f":"IF(BV260=\"\",\"\",AVERAGE($BV$10:BV260))","v":""},null,{"$f":"IF(BV260=\"\",\"\",_xlfn.NORM.DIST(BV260,AVERAGE($BV$10:$BV$5000),Dashboard!$L$36,FALSE))","v":""},{"$nulls":5},{"$f":"IF(BV260=\"\",\"\",_xlfn.NORM.DIST(BV260,AVERAGE(BV260:BW5250),Dashboard!$L$36,FALSE))","v":""}]
[{"$nulls":49},"",{"$nulls":11},"",{"$nulls":11},"",{"$nulls":4},"",null,{"$f":"IF(BV261=\"\",\"\",AVERAGE($BV$10:BV261))","v":""},null,{"$f":"IF(BV261=\"\",\"\",_xlfn.NORM.DIST(BV261,AVERAGE($BV$10:$BV$5000),Dashboard!$L$36,FALSE))","v":""},{"$nulls":5},{"$f":"IF(BV261=\"\",\"\",_xlfn.NORM.DIST(BV261,AVERAGE(BV261:BW5251),Dashboard!$L$36,FALSE))","v":""}]
[{"$nulls":49},"",{"$nulls":11},"",{"$nulls":11},"",{"$nulls":4},"",null,{"$f":"IF(BV262=\"\",\"\",AVERAGE($BV$10:BV262))","v":""},null,{"$f":"IF(BV262=\"\",\"\",_xlfn.NORM.DIST(BV262,AVERAGE($BV$10:$BV$5000),Dashboard!$L$36,FALSE))","v":""},{"$nulls":5},{"$f":"IF(BV262=\"\",\"\",_xlfn.NORM.DIST(BV262,AVERAGE(BV262:BW5252),Dashboard!$L$36,FALSE))","v":""}]
[{"$nulls":49},"",{"$nulls":11},"",{"$nulls":11},"",{"$nulls":4},"",null,{"$f":"IF(BV263=\"\",\"\",AVERAGE($BV$10:BV263))","v":""},null,{"$f":"IF(BV263=\"\",\"\",_xlfn.NORM.DIST(BV263,AVERAGE($BV$10:$BV$5000),Dashboard!$L$36,FALSE))","v":""},{"$nulls":5},{"$f":"IF(BV263=\"\",\"\",_xlfn.NORM.DIST(BV263,AVERAGE(BV263:BW5253),Dashboard!$L$36,FALSE))","v":""}]
[{"$nulls":49},"",{"$nulls":11},"",{"$nulls":11},"",{"$nulls":4},"",null,{"$f":"IF(BV264=\"\",\"\",AVERAGE($BV$10:BV264))","v":""},null,{"$f":"IF(BV264=\"\",\"\",_xlfn.NORM.DIST(BV264,AVERAGE($BV$10:$BV$5000),Dashboard!$L$36,FALSE))","v":""},{"$nulls":5},{"$f":"IF(BV264=\"\",\"\",_xlfn.NORM.DIST(BV264,AVERAGE(BV264:BW5254),Dashboard!$L$36,FALSE))","v":""}]
[{"$nulls":49},"",{"$nulls":11},"",{"$nulls":11},"",{"$nulls":4},"",null,{"$f":"IF(BV265=\"\",\"\",AVERAGE($BV$10:BV265))","v":""},null,{"$f":"IF(BV265=\"\",\"\",_xlfn.NORM.DIST(BV265,AVERAGE($BV$10:$BV$5000),Dashboard!$L$36,FALSE))","v":""},{"$nulls":5},{"$f":"IF(BV265=\"\",\"\",_xlfn.NORM.DIST(BV265,AVERAGE(BV265:BW5255),Dashboard!$L$36,FALSE))","v":""}]
[{"$nulls":49},"",{"$nulls":11},"",{"$nulls":11},"",{"$nulls":4},"",null,{"$f":"IF(BV266=\"\",\"\",AVERAGE($BV$10:BV266))","v":""},null,{"$f":"IF(BV266=\"\",\"\",_xlfn.NORM.DIST(BV266,AVERAGE($BV$10:$BV$5000),Dashboard!$L$36,FALSE))","v":""},{"$nulls":5},{"$f":"IF(BV266=\"\",\"\",_xlfn.NORM.DIST(BV266,AVERAGE(BV266:BW5256),Dashboard!$L$36,FALSE))","v":""}]
[{"$nulls":49},"",{"$nulls":11},"",{"$nulls":11},"",{"$nulls":4},"",null,{"$f":"IF(BV267=\"\",\"\",AVERAGE($BV$10:BV267))","v":""},null,{"$f":"IF(BV267=\"\",\"\",_xlfn.NORM.DIST(BV267,AVERAGE($BV$10:$BV$5000),Dashboard!$L$36,FALSE))","v":""},{"$nulls":5},{"$f":"IF(BV267=\"\",\"\",_xlfn.NORM.DIST(BV267,AVERAGE(BV267:BW5257),Dashboard!$L$36,FALSE))","v":""}]
[{"$nulls":49},"",{"$nulls":11},"",{"$nulls":11},"",{"$nulls":4},"",null,{"$f":"IF(BV268=\"\",\"\",AVERAGE($BV$10:BV268))","v":""},null,{"$f":"IF(BV268=\"\",\"\",_xlfn.NORM.DIST(BV268,AVERAGE($BV$10:$BV$5000),Dashboard!$L$36,FALSE))","v":""},{"$nulls":5},{"$f":"IF(BV268=\"\",\"\",_xlfn.NORM.DIST(BV268,AVERAGE(BV268:BW5258),Dashboard!$L$36,FALSE))","v":""}]
[{"$nulls":49},"",{"$nulls":11},"",{"$nulls":11},"",{"$nulls":4},"",null,{"$f":"IF(BV269=\"\",\"\",AVERAGE($BV$10:BV269))","v":""},null,{"$f":"IF(BV269=\"\",\"\",_xlfn.NORM.DIST(BV269,AVERAGE($BV$10:$BV$5000),Dashboard!$L$36,FALSE))","v":""},{"$nulls":5},{"$f":"IF(BV269=\"\",\"\",_xlfn.NORM.DIST(BV269,AVERAGE(BV269:BW5259),Dashboard!$L$36,FALSE))","v":""}]
[{"$nulls":49},"",{"$nulls":11},"",{"$nulls":11},"",{"$nulls":4},"",null,{"$f":"IF(BV270=\"\",\"\",AVERAGE($BV$10:BV270))","v":""},null,{"$f":"IF(BV270=\"\",\"\",_xlfn.NORM.DIST(BV270,AVERAGE($BV$10:$BV$5000),Dashboard!$L$36,FALSE))","v":""},{"$nulls":5},{"$f":"IF(BV270=\"\",\"\",_xlfn.NORM.DIST(BV270,AVERAGE(BV270:BW5260),Dashboard!$L$36,FALSE))","v":""}]
[{"$nulls":49},"",{"$nulls":11},"",{"$nulls":11},"",{"$nulls":4},"",null,{"$f":"IF(BV271=\"\",\"\",AVERAGE($BV$10:BV271))","v":""},null,{"$f":"IF(BV271=\"\",\"\",_xlfn.NORM.DIST(BV271,AVERAGE($BV$10:$BV$5000),Dashboard!$L$36,FALSE))","v":""},{"$nulls":5},{"$f":"IF(BV271=\"\",\"\",_xlfn.NORM.DIST(BV271,AVERAGE(BV271:BW5261),Dashboard!$L$36,FALSE))","v":""}]
[{"$nulls":49},"",{"$nulls":11},"",{"$nulls":11},"",{"$nulls":4},"",null,{"$f":"IF(BV272=\"\",\"\",AVERAGE($BV$10:BV272))","v":""},null,{"$f":"IF(BV272=\"\",\"\",_xlfn.NORM.DIST(BV272,AVERAGE($BV$10:$BV$5000),Dashboard!$L$36,FALSE))","v":""},{"$nulls":5},{"$f":"IF(BV272=\"\",\"\",_xlfn.NORM.DIST(BV272,AVERAGE(BV272:BW5262),Dashboard!$L$36,FALSE))","v":""}]
[{"$nulls":49},"",{"$nulls":11},"",{"$nulls":11},"",{"$nulls":4},"",null,{"$f":"IF(BV273=\"\",\"\",AVERAGE($BV$10:BV273))","v":""},null,{"$f":"IF(BV273=\"\",\"\",_xlfn.NORM.DIST(BV273,AVERAGE($BV$10:$BV$5000),Dashboard!$L$36,FALSE))","v":""},{"$nulls":5},{"$f":"IF(BV273=\"\",\"\",_xlfn.NORM.DIST(BV273,AVERAGE(BV273:BW5263),Dashboard!$L$36,FALSE))","v":""}]
[{"$nulls":49},"",{"$nulls":11},"",{"$nulls":11},"",{"$nulls":4},"",null,{"$f":"IF(BV274=\"\",\"\",AVERAGE($BV$10:BV274))","v":""},null,{"$f":"IF(BV274=\"\",\"\",_xlfn.NORM.DIST(BV274,AVERAGE($BV$10:$BV$5000),Dashboard!$L$36,FALSE))","v":""},{"$nulls":5},{"$f":"IF(BV274=\"\",\"\",_xlfn.NORM.DIST(BV274,AVERAGE(BV274:BW5264),Dashboard!$L$36,FALSE))","v":""}]
[{"$nulls":49},"",{"$nulls":11},"",{"$nulls":11},"",{"$nulls":4},"",null,{"$f":"IF(BV275=\"\",\"\",AVERAGE($BV$10:BV275))","v":""},null,{"$f":"IF(BV275=\"\",\"\",_xlfn.NORM.DIST(BV275,AVERAGE($BV$10:$BV$5000),Dashboard!$L$36,FALSE))","v":""},{"$nulls":5},{"$f":"IF(BV275=\"\",\"\",_xlfn.NORM.DIST(BV275,AVERAGE(BV275:BW5265),Dashboard!$L$36,FALSE))","v":""}]
[{"$nulls":49},"",{"$nulls":11},"",{"$nulls":11},"",{"$nulls":4},"",null,{"$f":"IF(BV276=\"\",\"\",AVERAGE($BV$10:BV276))","v":""},null,{"$f":"IF(BV276=\"\",\"\",_xlfn.NORM.DIST(BV276,AVERAGE($BV$10:$BV$5000),Dashboard!$L$36,FALSE))","v":""},{"$nulls":5},{"$f":"IF(BV276=\"\",\"\",_xlfn.NORM.DIST(BV276,AVERAGE(BV276:BW5266),Dashboard!$L$36,FALSE))","v":""}]
[{"$nulls":49},{"$f":"IF(SUM(AR277:AW277)=0,\"\",AVERAGE(AR277:AW277))","v":""},{"$nulls":11},{"$f":"IF(SUM(BD277:BI277)=0,\"\",AVERAGE(BD277:BI277))","v":""},{"$nulls":11},{"$f":"IF(SUM(BP277:BU277)=0,\"\",AVERAGE(BP277:BU277))","v":""},{"$nulls":4},{"$f":"IF(BV277=\"\",\"\",BV277-AJ277)","v":""},null,{"$f":"IF(BV277=\"\",\"\",AVERAGE($BV$10:BV277))","v":""},null,{"$f":"IF(BV277=\"\",\"\",_xlfn.NORM.DIST(BV277,AVERAGE($BV$10:$BV$5000),Dashboard!$L$36,FALSE))","v":""},{"$nulls":5},{"$f":"IF(BV277=\"\",\"\",_xlfn.NORM.DIST(BV277,AVERAGE(BV277:BW5267),Dashboard!$L$36,FALSE))","v":""}]
[{"$nulls":49},"",{"$nulls":11},"",{"$nulls":11},"",{"$nulls":4},"",null,{"$f":"IF(BV278=\"\",\"\",AVERAGE($BV$10:BV278))","v":""},null,{"$f":"IF(BV278=\"\",\"\",_xlfn.NORM.DIST(BV278,AVERAGE($BV$10:$BV$5000),Dashboard!$L$36,FALSE))","v":""},{"$nulls":5},{"$f":"IF(BV278=\"\",\"\",_xlfn.NORM.DIST(BV278,AVERAGE(BV278:BW5268),Dashboard!$L$36,FALSE))","v":""}]
[{"$nulls":49},"",{"$nulls":11},"",{"$nulls":11},"",{"$nulls":4},"",null,{"$f":"IF(BV279=\"\",\"\",AVERAGE($BV$10:BV279))","v":""},null,{"$f":"IF(BV279=\"\",\"\",_xlfn.NORM.DIST(BV279,AVERAGE($BV$10:$BV$5000),Dashboard!$L$36,FALSE))","v":""},{"$nulls":5},{"$f":"IF(BV279=\"\",\"\",_xlfn.NORM.DIST(BV279,AVERAGE(BV279:BW5269),Dashboard!$L$36,FALSE))","v":""}]
[{"$nulls":49},"",{"$nulls":11},"",{"$nulls":11},"",{"$nulls":4},"",null,{"$f":"IF(BV280=\"\",\"\",AVERAGE($BV$10:BV280))","v":""},null,{"$f":"IF(BV280=\"\",\"\",_xlfn.NORM.DIST(BV280,AVERAGE($BV$10:$BV$5000),Dashboard!$L$36,FALSE))","v":""},{"$nulls":5},{"$f":"IF(BV280=\"\",\"\",_xlfn.NORM.DIST(BV280,AVERAGE(BV280:BW5270),Dashboard!$L$36,FALSE))","v":""}]
[{"$nulls":49},"",{"$nulls":11},"",{"$nulls":11},"",{"$nulls":4},"",null,{"$f":"IF(BV281=\"\",\"\",AVERAGE($BV$10:BV281))","v":""},null,{"$f":"IF(BV281=\"\",\"\",_xlfn.NORM.DIST(BV281,AVERAGE($BV$10:$BV$5000),Dashboard!$L$36,FALSE))","v":""},{"$nulls":5},{"$f":"IF(BV281=\"\",\"\",_xlfn.NORM.DIST(BV281,AVERAGE(BV281:BW5271),Dashboard!$L$36,FALSE))","v":""}]
[{"$nulls":49},"",{"$nulls":11},"",{"$nulls":11},"",{"$nulls":4},"",null,{"$f":"IF(BV282=\"\",\"\",AVERAGE($BV$10:BV282))","v":""},null,{"$f":"IF(BV282=\"\",\"\",_xlfn.NORM.DIST(BV282,AVERAGE($BV$10:$BV$5000),Dashboard!$L$36,FALSE))","v":""},{"$nulls":5},{"$f":"IF(BV282=\"\",\"\",_xlfn.NORM.DIST(BV282,AVERAGE(BV282:BW5272),Dashboard!$L$36,FALSE))","v":""}]
[{"$nulls":49},"",{"$nulls":11},"",{"$nulls":11},"",{"$nulls":4},"",null,{"$f":"IF(BV283=\"\",\"\",AVERAGE($BV$10:BV283))","v":""},null,{"$f":"IF(BV283=\"\",\"\",_xlfn.NORM.DIST(BV283,AVERAGE($BV$10:$BV$5000),Dashboard!$L$36,FALSE))","v":""},{"$nulls":5},{"$f":"IF(BV283=\"\",\"\",_xlfn.NORM.DIST(BV283,AVERAGE(BV283:BW5273),Dashboard!$L$36,FALSE))","v":""}]
[{"$nulls":49},"",{"$nulls":11},"",{"$nulls":11},"",{"$nulls":4},"",null,{"$f":"IF(BV284=\"\",\"\",AVERAGE($BV$10:BV284))","v":""},null,{"$f":"IF(BV284=\"\",\"\",_xlfn.NORM.DIST(BV284,AVERAGE($BV$10:$BV$5000),Dashboard!$L$36,FALSE))","v":""},{"$nulls":5},{"$f":"IF(BV284=\"\",\"\",_xlfn.NORM.DIST(BV284,AVERAGE(BV284:BW5274),Dashboard!$L$36,FALSE))","v":""}]
[{"$nulls":49},"",{"$nulls":11},"",{"$nulls":11},"",{"$nulls":4},"",null,{"$f":"IF(BV285=\"\",\"\",AVERAGE($BV$10:BV285))","v":""},null,{"$f":"IF(BV285=\"\",\"\",_xlfn.NORM.DIST(BV285,AVERAGE($BV$10:$BV$5000),Dashboard!$L$36,FALSE))","v":""},{"$nulls":5},{"$f":"IF(BV285=\"\",\"\",_xlfn.NORM.DIST(BV285,AVERAGE(BV285:BW5275),Dashboard!$L$36,FALSE))","v":""}]
[{"$nulls":49},"",{"$nulls":11},"",{"$nulls":11},"",{"$nulls":4},"",null,{"$f":"IF(BV286=\"\",\"\",AVERAGE($BV$10:BV286))","v":""},null,{"$f":"IF(BV286=\"\",\"\",_xlfn.NORM.DIST(BV286,AVERAGE($BV$10:$BV$5000),Dashboard!$L$36,FALSE))","v":""},{"$nulls":5},{"$f":"IF(BV286=\"\",\"\",_xlfn.NORM.DIST(BV286,AVERAGE(BV286:BW5276),Dashboard!$L$36,FALSE))","v":""}]
[{"$nulls":49},"",{"$nulls":11},"",{"$nulls":11},"",{"$nulls":4},"",null,{"$f":"IF(BV287=\"\",\"\",AVERAGE($BV$10:BV287))","v":""},null,{"$f":"IF(BV287=\"\",\"\",_xlfn.NORM.DIST(BV287,AVERAGE($BV$10:$BV$5000),Dashboard!$L$36,FALSE))","v":""},{"$nulls":5},{"$f":"IF(BV287=\"\",\"\",_xlfn.NORM.DIST(BV287,AVERAGE(BV287:BW5277),Dashboard!$L$36,FALSE))","v":""}]
[{"$nulls":49},"",{"$nulls":11},"",{"$nulls":11},"",{"$nulls":4},"",null,{"$f":"IF(BV288=\"\",\"\",AVERAGE($BV$10:BV288))","v":""},null,{"$f":"IF(BV288=\"\",\"\",_xlfn.NORM.DIST(BV288,AVERAGE($BV$10:$BV$5000),Dashboard!$L$36,FALSE))","v":""},{"$nulls":5},{"$f":"IF(BV288=\"\",\"\",_xlfn.NORM.DIST(BV288,AVERAGE(BV288:BW5278),Dashboard!$L$36,FALSE))","v":""}]
[{"$nulls":49},"",{"$nulls":11},"",{"$nulls":11},"",{"$nulls":4},"",null,{"$f":"IF(BV289=\"\",\"\",AVERAGE($BV$10:BV289))","v":""},null,{"$f":"IF(BV289=\"\",\"\",_xlfn.NORM.DIST(BV289,AVERAGE($BV$10:$BV$5000),Dashboard!$L$36,FALSE))","v":""},{"$nulls":5},{"$f":"IF(BV289=\"\",\"\",_xlfn.NORM.DIST(BV289,AVERAGE(BV289:BW5279),Dashboard!$L$36,FALSE))","v":""}]
[{"$nulls":49},"",{"$nulls":11},"",{"$nulls":11},"",{"$nulls":4},"",null,{"$f":"IF(BV290=\"\",\"\",AVERAGE($BV$10:BV290))","v":""},null,{"$f":"IF(BV290=\"\",\"\",_xlfn.NORM.DIST(BV290,AVERAGE($BV$10:$BV$5000),Dashboard!$L$36,FALSE))","v":""},{"$nulls":5},{"$f":"IF(BV290=\"\",\"\",_xlfn.NORM.DIST(BV290,AVERAGE(BV290:BW5280),Dashboard!$L$36,FALSE))","v":""}]
[{"$nulls":49},"",{"$nulls":11},"",{"$nulls":11},"",{"$nulls":4},"",null,{"$f":"IF(BV291=\"\",\"\",AVERAGE($BV$10:BV291))","v":""},null,{"$f":"IF(BV291=\"\",\"\",_xlfn.NORM.DIST(BV291,AVERAGE($BV$10:$BV$5000),Dashboard!$L$36,FALSE))","v":""},{"$nulls":5},{"$f":"IF(BV291=\"\",\"\",_xlfn.NORM.DIST(BV291,AVERAGE(BV291:BW5281),Dashboard!$L$36,FALSE))","v":""}]
[{"$nulls":49},"",{"$nulls":11},"",{"$nulls":11},"",{"$nulls":4},"",null,{"$f":"IF(BV292=\"\",\"\",AVERAGE($BV$10:BV292))","v":""},null,{"$f":"IF(BV292=\"\",\"\",_xlfn.NORM.DIST(BV292,AVERAGE($BV$10:$BV$5000),Dashboard!$L$36,FALSE))","v":""},{"$nulls":5},{"$f":"IF(BV292=\"\",\"\",_xlfn.NORM.DIST(BV292,AVERAGE(BV292:BW5282),Dashboard!$L$36,FALSE))","v":""}]
[{"$nulls":49},"",{"$nulls":11},"",{"$nulls":11},"",{"$nulls":4},"",null,{"$f":"IF(BV293=\"\",\"\",AVERAGE($BV$10:BV293))","v":""},null,{"$f":"IF(BV293=\"\",\"\",_xlfn.NORM.DIST(BV293,AVERAGE($BV$10:$BV$5000),Dashboard!$L$36,FALSE))","v":""},{"$nulls":5},{"$f":"IF(BV293=\"\",\"\",_xlfn.NORM.DIST(BV293,AVERAGE(BV293:BW5283),Dashboard!$L$36,FALSE))","v":""}]
[{"$nulls":49},"",{"$nulls":11},"",{"$nulls":11},"",{"$nulls":4},"",null,{"$f":"IF(BV294=\"\",\"\",AVERAGE($BV$10:BV294))","v":""},null,{"$f":"IF(BV294=\"\",\"\",_xlfn.NORM.DIST(BV294,AVERAGE($BV$10:$BV$5000),Dashboard!$L$36,FALSE))","v":""},{"$nulls":5},{"$f":"IF(BV294=\"\",\"\",_xlfn.NORM.DIST(BV294,AVERAGE(BV294:BW5284),Dashboard!$L$36,FALSE))","v":""}]
[{"$nulls":49},"",{"$nulls":11},"",{"$nulls":11},"",{"$nulls":4},"",null,{"$f":"IF(BV295=\"\",\"\",AVERAGE($BV$10:BV295))","v":""},null,{"$f":"IF(BV295=\"\",\"\",_xlfn.NORM.DIST(BV295,AVERAGE($BV$10:$BV$5000),Dashboard!$L$36,FALSE))","v":""},{"$nulls":5},{"$f":"IF(BV295=\"\",\"\",_xlfn.NORM.DIST(BV295,AVERAGE(BV295:BW5285),Dashboard!$L$36,FALSE))","v":""}]
[{"$nulls":49},"",{"$nulls":11},"",{"$nulls":11},"",{"$nulls":4},"",null,{"$f":"IF(BV296=\"\",\"\",AVERAGE($BV$10:BV296))","v":""},null,{"$f":"IF(BV296=\"\",\"\",_xlfn.NORM.DIST(BV296,AVERAGE($BV$10:$BV$5000),Dashboard!$L$36,FALSE))","v":""},{"$nulls":5},{"$f":"IF(BV296=\"\",\"\",_xlfn.NORM.DIST(BV296,AVERAGE(BV296:BW5286),Dashboard!$L$36,FALSE))","v":""}]
[{"$nulls":49},"",{"$nulls":11},"",{"$nulls":11},"",{"$nulls":4},"",null,{"$f":"IF(BV297=\"\",\"\",AVERAGE($BV$10:BV297))","v":""},null,{"$f":"IF(BV297=\"\",\"\",_xlfn.NORM.DIST(BV297,AVERAGE($BV$10:$BV$5000),Dashboard!$L$36,FALSE))","v":""},{"$nulls":5},{"$f":"IF(BV297=\"\",\"\",_xlfn.NORM.DIST(BV297,AVERAGE(BV297:BW5287),Dashboard!$L$36,FALSE))","v":""}]
[{"$nulls":49},"",{"$nulls":11},"",{"$nulls":11},"",{"$nulls":4},"",null,{"$f":"IF(BV298=\"\",\"\",AVERAGE($BV$10:BV298))","v":""},null,{"$f":"IF(BV298=\"\",\"\",_xlfn.NORM.DIST(BV298,AVERAGE($BV$10:$BV$5000),Dashboard!$L$36,FALSE))","v":""},{"$nulls":5},{"$f":"IF(BV298=\"\",\"\",_xlfn.NORM.DIST(BV298,AVERAGE(BV298:BW5288),Dashboard!$L$36,FALSE))","v":""}]
[{"$nulls":49},"",{"$nulls":11},"",{"$nulls":11},"",{"$nulls":4},"",null,{"$f":"IF(BV299=\"\",\"\",AVERAGE($BV$10:BV299))","v":""},null,{"$f":"IF(BV299=\"\",\"\",_xlfn.NORM.DIST(BV299,AVERAGE($BV$10:$BV$5000),Dashboard!$L$36,FALSE))","v":""},{"$nulls":5},{"$f":"IF(BV299=\"\",\"\",_xlfn.NORM.DIST(BV299,AVERAGE(BV299:BW5289),Dashboard!$L$36,FALSE))","v":""}]
[{"$nulls":49},"",{"$nulls":11},"",{"$nulls":11},"",{"$nulls":4},"",null,{"$f":"IF(BV300=\"\",\"\",AVERAGE($BV$10:BV300))","v":""},null,{"$f":"IF(BV300=\"\",\"\",_xlfn.NORM.DIST(BV300,AVERAGE($BV$10:$BV$5000),Dashboard!$L$36,FALSE))","v":""},{"$nulls":5},{"$f":"IF(BV300=\"\",\"\",_xlfn.NORM.DIST(BV300,AVERAGE(BV300:BW5290),Dashboard!$L$36,FALSE))","v":""}]
[{"$nulls":49},"",{"$nulls":11},"",{"$nulls":11},"",{"$nulls":4},"",null,{"$f":"IF(BV301=\"\",\"\",AVERAGE($BV$10:BV301))","v":""},null,{"$f":"IF(BV301=\"\",\"\",_xlfn.NORM.DIST(BV301,AVERAGE($BV$10:$BV$5000),Dashboard!$L$36,FALSE))","v":""},{"$nulls":5},{"$f":"IF(BV301=\"\",\"\",_xlfn.NORM.DIST(BV301,AVERAGE(BV301:BW5291),Dashboard!$L$36,FALSE))","v":""}]
[{"$nulls":49},"",{"$nulls":11},"",{"$nulls":11},"",{"$nulls":4},"",null,{"$f":"IF(BV302=\"\",\"\",AVERAGE($BV$10:BV302))","v":""},null,{"$f":"IF(BV302=\"\",\"\",_xlfn.NORM.DIST(BV302,AVERAGE($BV$10:$BV$5000),Dashboard!$L$36,FALSE))","v":""},{"$nulls":5},{"$f":"IF(BV302=\"\",\"\",_xlfn.NORM.DIST(BV302,AVERAGE(BV302:BW5292),Dashboard!$L$36,FALSE))","v":""}]
[{"$nulls":49},"",{"$nulls":11},"",{"$nulls":11},"",{"$nulls":4},"",null,{"$f":"IF(BV303=\"\",\"\",AVERAGE($BV$10:BV303))","v":""},null,{"$f":"IF(BV303=\"\",\"\",_xlfn.NORM.DIST(BV303,AVERAGE($BV$10:$BV$5000),Dashboard!$L$36,FALSE))","v":""},{"$nulls":5},{"$f":"IF(BV303=\"\",\"\",_xlfn.NORM.DIST(BV303,AVERAGE(BV303:BW5293),Dashboard!$L$36,FALSE))","v":""}]
[{"$nulls":49},"",{"$nulls":11},"",{"$nulls":11},"",{"$nulls":4},"",null,{"$f":"IF(BV304=\"\",\"\",AVERAGE($BV$10:BV304))","v":""},null,{"$f":"IF(BV304=\"\",\"\",_xlfn.NORM.DIST(BV304,AVERAGE($BV$10:$BV$5000),Dashboard!$L$36,FALSE))","v":""},{"$nulls":5},{"$f":"IF(BV304=\"\",\"\",_xlfn.NORM.DIST(BV304,AVERAGE(BV304:BW5294),Dashboard!$L$36,FALSE))","v":""}]
[{"$nulls":49},"",{"$nulls":11},"",{"$nulls":11},"",{"$nulls":4},"",null,{"$f":"IF(BV305=\"\",\"\",AVERAGE($BV$10:BV305))","v":""},null,{"$f":"IF(BV305=\"\",\"\",_xlfn.NORM.DIST(BV305,AVERAGE($BV$10:$BV$5000),Dashboard!$L$36,FALSE))","v":""},{"$nulls":5},{"$f":"IF(BV305=\"\",\"\",_xlfn.NORM.DIST(BV305,AVERAGE(BV305:BW5295),Dashboard!$L$36,FALSE))","v":""}]
[{"$nulls":49},"",{"$nulls":11},"",{"$nulls":11},"",{"$nulls":4},"",null,{"$f":"IF(BV306=\"\",\"\",AVERAGE($BV$10:BV306))","v":""},null,{"$f":"IF(BV306=\"\",\"\",_xlfn.NORM.DIST(BV306,AVERAGE($BV$10:$BV$5000),Dashboard!$L$36,FALSE))","v":""},{"$nulls":5},{"$f":"IF(BV306=\"\",\"\",_xlfn.NORM.DIST(BV306,AVERAGE(BV306:BW5296),Dashboard!$L$36,FALSE))","v":""}]
[{"$nulls":49},"",{"$nulls":11},"",{"$nulls":11},"",{"$nulls":4},"",null,{"$f":"IF(BV307=\"\",\"\",AVERAGE($BV$10:BV307))","v":""},null,{"$f":"IF(BV307=\"\",\"\",_xlfn.NORM.DIST(BV307,AVERAGE($BV$10:$BV$5000),Dashboard!$L$36,FALSE))","v":""},{"$nulls":5},{"$f":"IF(BV307=\"\",\"\",_xlfn.NORM.DIST(BV307,AVERAGE(BV307:BW5297),Dashboard!$L$36,FALSE))","v":""}]
[{"$nulls":49},"",{"$nulls":11},"",{"$nulls":11},"",{"$nulls":4},"",null,{"$f":"IF(BV308=\"\",\"\",AVERAGE($BV$10:BV308))","v":""},null,{"$f":"IF(BV308=\"\",\"\",_xlfn.NORM.DIST(BV308,AVERAGE($BV$10:$BV$5000),Dashboard!$L$36,FALSE))","v":""},{"$nulls":5},{"$f":"IF(BV308=\"\",\"\",_xlfn.NORM.DIST(BV308,AVERAGE(BV308:BW5298),Dashboard!$L$36,FALSE))","v":""}]
[{"$nulls":49},"",{"$nulls":11},"",{"$nulls":11},"",{"$nulls":4},"",null,{"$f":"IF(BV309=\"\",\"\",AVERAGE($BV$10:BV309))","v":""},null,{"$f":"IF(BV309=\"\",\"\",_xlfn.NORM.DIST(BV309,AVERAGE($BV$10:$BV$5000),Dashboard!$L$36,FALSE))","v":""},{"$nulls":5},{"$f":"IF(BV309=\"\",\"\",_xlfn.NORM.DIST(BV309,AVERAGE(BV309:BW5299),Dashboard!$L$36,FALSE))","v":""}]
[{"$nulls":49},"",{"$nulls":11},"",{"$nulls":11},"",{"$nulls":4},"",null,{"$f":"IF(BV310=\"\",\"\",AVERAGE($BV$10:BV310))","v":""},null,{"$f":"IF(BV310=\"\",\"\",_xlfn.NORM.DIST(BV310,AVERAGE($BV$10:$BV$5000),Dashboard!$L$36,FALSE))","v":""},{"$nulls":5},{"$f":"IF(BV310=\"\",\"\",_xlfn.NORM.DIST(BV310,AVERAGE(BV310:BW5300),Dashboard!$L$36,FALSE))","v":""}]
[{"$nulls":49},"",{"$nulls":11},"",{"$nulls":11},"",{"$nulls":4},"",null,{"$f":"IF(BV311=\"\",\"\",AVERAGE($BV$10:BV311))","v":""},null,{"$f":"IF(BV311=\"\",\"\",_xlfn.NORM.DIST(BV311,AVERAGE($BV$10:$BV$5000),Dashboard!$L$36,FALSE))","v":""},{"$nulls":5},{"$f":"IF(BV311=\"\",\"\",_xlfn.NORM.DIST(BV311,AVERAGE(BV311:BW5301),Dashboard!$L$36,FALSE))","v":""}]
[{"$nulls":49},"",{"$nulls":11},"",{"$nulls":11},"",{"$nulls":4},"",null,{"$f":"IF(BV312=\"\",\"\",AVERAGE($BV$10:BV312))","v":""},null,{"$f":"IF(BV312=\"\",\"\",_xlfn.NORM.DIST(BV312,AVERAGE($BV$10:$BV$5000),Dashboard!$L$36,FALSE))","v":""},{"$nulls":5},{"$f":"IF(BV312=\"\",\"\",_xlfn.NORM.DIST(BV312,AVERAGE(BV312:BW5302),Dashboard!$L$36,FALSE))","v":""}]
[{"$nulls":49},"",{"$nulls":11},"",{"$nulls":11},"",{"$nulls":4},"",null,{"$f":"IF(BV313=\"\",\"\",AVERAGE($BV$10:BV313))","v":""},null,{"$f":"IF(BV313=\"\",\"\",_xlfn.NORM.DIST(BV313,AVERAGE($BV$10:$BV$5000),Dashboard!$L$36,FALSE))","v":""},{"$nulls":5},{"$f":"IF(BV313=\"\",\"\",_xlfn.NORM.DIST(BV313,AVERAGE(BV313:BW5303),Dashboard!$L$36,FALSE))","v":""}]
[{"$nulls":49},"",{"$nulls":11},"",{"$nulls":11},"",{"$nulls":4},"",null,{"$f":"IF(BV314=\"\",\"\",AVERAGE($BV$10:BV314))","v":""},null,{"$f":"IF(BV314=\"\",\"\",_xlfn.NORM.DIST(BV314,AVERAGE($BV$10:$BV$5000),Dashboard!$L$36,FALSE))","v":""},{"$nulls":5},{"$f":"IF(BV314=\"\",\"\",_xlfn.NORM.DIST(BV314,AVERAGE(BV314:BW5304),Dashboard!$L$36,FALSE))","v":""}]
[{"$nulls":49},"",{"$nulls":11},"",{"$nulls":11},"",{"$nulls":4},"",null,{"$f":"IF(BV315=\"\",\"\",AVERAGE($BV$10:BV315))","v":""},null,{"$f":"IF(BV315=\"\",\"\",_xlfn.NORM.DIST(BV315,AVERAGE($BV$10:$BV$5000),Dashboard!$L$36,FALSE))","v":""},{"$nulls":5},{"$f":"IF(BV315=\"\",\"\",_xlfn.NORM.DIST(BV315,AVERAGE(BV315:BW5305),Dashboard!$L$36,FALSE))","v":""}]
[{"$nulls":49},"",{"$nulls":11},"",{"$nulls":11},"",{"$nulls":4},"",null,{"$f":"IF(BV316=\"\",\"\",AVERAGE($BV$10:BV316))","v":""},null,{"$f":"IF(BV316=\"\",\"\",_xlfn.NORM.DIST(BV316,AVERAGE($BV$10:$BV$5000),Dashboard!$L$36,FALSE))","v":""},{"$nulls":5},{"$f":"IF(BV316=\"\",\"\",_xlfn.NORM.DIST(BV316,AVERAGE(BV316:BW5306),Dashboard!$L$36,FALSE))","v":""}]
[{"$nulls":49},"",{"$nulls":11},"",{"$nulls":11},"",{"$nulls":4},"",null,{"$f":"IF(BV317=\"\",\"\",AVERAGE($BV$10:BV317))","v":""},null,{"$f":"IF(BV317=\"\",\"\",_xlfn.NORM.DIST(BV317,AVERAGE($BV$10:$BV$5000),Dashboard!$L$36,FALSE))","v":""},{"$nulls":5},{"$f":"IF(BV317=\"\",\"\",_xlfn.NORM.DIST(BV317,AVERAGE(BV317:BW5307),Dashboard!$L$36,FALSE))","v":""}]
[{"$nulls":49},"",{"$nulls":11},"",{"$nulls":11},"",{"$nulls":4},"",null,{"$f":"IF(BV318=\"\",\"\",AVERAGE($BV$10:BV318))","v":""},null,{"$f":"IF(BV318=\"\",\"\",_xlfn.NORM.DIST(BV318,AVERAGE($BV$10:$BV$5000),Dashboard!$L$36,FALSE))","v":""},{"$nulls":5},{"$f":"IF(BV318=\"\",\"\",_xlfn.NORM.DIST(BV318,AVERAGE(BV318:BW5308),Dashboard!$L$36,FALSE))","v":""}]
[{"$nulls":49},"",{"$nulls":11},"",{"$nulls":11},"",{"$nulls":4},"",null,{"$f":"IF(BV319=\"\",\"\",AVERAGE($BV$10:BV319))","v":""},null,{"$f":"IF(BV319=\"\",\"\",_xlfn.NORM.DIST(BV319,AVERAGE($BV$10:$BV$5000),Dashboard!$L$36,FALSE))","v":""},{"$nulls":5},{"$f":"IF(BV319=\"\",\"\",_xlfn.NORM.DIST(BV319,AVERAGE(BV319:BW5309),Dashboard!$L$36,FALSE))","v":""}]
[{"$nulls":49},"",{"$nulls":11},"",{"$nulls":11},"",{"$nulls":4},"",null,{"$f":"IF(BV320=\"\",\"\",AVERAGE($BV$10:BV320))","v":""},null,{"$f":"IF(BV320=\"\",\"\",_xlfn.NORM.DIST(BV320,AVERAGE($BV$10:$BV$5000),Dashboard!$L$36,FALSE))","v":""},{"$nulls":5},{"$f":"IF(BV320=\"\",\"\",_xlfn.NORM.DIST(BV320,AVERAGE(BV320:BW5310),Dashboard!$L$36,FALSE))","v":""}]
[{"$nulls":49},"",{"$nulls":11},"",{"$nulls":11},"",{"$nulls":4},"",null,{"$f":"IF(BV321=\"\",\"\",AVERAGE($BV$10:BV321))","v":""},null,{"$f":"IF(BV321=\"\",\"\",_xlfn.NORM.DIST(BV321,AVERAGE($BV$10:$BV$5000),Dashboard!$L$36,FALSE))","v":""},{"$nulls":5},{"$f":"IF(BV321=\"\",\"\",_xlfn.NORM.DIST(BV321,AVERAGE(BV321:BW5311),Dashboard!$L$36,FALSE))","v":""}]
[{"$nulls":49},"",{"$nulls":11},"",{"$nulls":11},"",{"$nulls":4},"",null,{"$f":"IF(BV322=\"\",\"\",AVERAGE($BV$10:BV322))","v":""},null,{"$f":"IF(BV322=\"\",\"\",_xlfn.NORM.DIST(BV322,AVERAGE($BV$10:$BV$5000),Dashboard!$L$36,FALSE))","v":""},{"$nulls":5},{"$f":"IF(BV322=\"\",\"\",_xlfn.NORM.DIST(BV322,AVERAGE(BV322:BW5312),Dashboard!$L$36,FALSE))","v":""}]
[{"$nulls":49},"",{"$nulls":11},"",{"$nulls":11},"",{"$nulls":4},"",null,{"$f":"IF(BV323=\"\",\"\",AVERAGE($BV$10:BV323))","v":""},null,{"$f":"IF(BV323=\"\",\"\",_xlfn.NORM.DIST(BV323,AVERAGE($BV$10:$BV$5000),Dashboard!$L$36,FALSE))","v":""},{"$nulls":5},{"$f":"IF(BV323=\"\",\"\",_xlfn.NORM.DIST(BV323,AVERAGE(BV323:BW5313),Dashboard!$L$36,FALSE))","v":""}]
[{"$nulls":49},"",{"$nulls":11},"",{"$nulls":11},"",{"$nulls":4},"",null,{"$f":"IF(BV324=\"\",\"\",AVERAGE($BV$10:BV324))","v":""},null,{"$f":"IF(BV324=\"\",\"\",_xlfn.NORM.DIST(BV324,AVERAGE($BV$10:$BV$5000),Dashboard!$L$36,FALSE))","v":""},{"$nulls":5},{"$f":"IF(BV324=\"\",\"\",_xlfn.NORM.DIST(BV324,AVERAGE(BV324:BW5314),Dashboard!$L$36,FALSE))","v":""}]
[{"$nulls":49},"",{"$nulls":11},"",{"$nulls":11},"",{"$nulls":4},"",null,{"$f":"IF(BV325=\"\",\"\",AVERAGE($BV$10:BV325))","v":""},null,{"$f":"IF(BV325=\"\",\"\",_xlfn.NORM.DIST(BV325,AVERAGE($BV$10:$BV$5000),Dashboard!$L$36,FALSE))","v":""},{"$nulls":5},{"$f":"IF(BV325=\"\",\"\",_xlfn.NORM.DIST(BV325,AVERAGE(BV325:BW5315),Dashboard!$L$36,FALSE))","v":""}]
[{"$nulls":49},"",{"$nulls":11},"",{"$nulls":11},"",{"$nulls":4},"",null,{"$f":"IF(BV326=\"\",\"\",AVERAGE($BV$10:BV326))","v":""},null,{"$f":"IF(BV326=\"\",\"\",_xlfn.NORM.DIST(BV326,AVERAGE($BV$10:$BV$5000),Dashboard!$L$36,FALSE))","v":""},{"$nulls":5},{"$f":"IF(BV326=\"\",\"\",_xlfn.NORM.DIST(BV326,AVERAGE(BV326:BW5316),Dashboard!$L$36,FALSE))","v":""}]
[{"$nulls":49},"",{"$nulls":11},"",{"$nulls":11},"",{"$nulls":4},"",null,{"$f":"IF(BV327=\"\",\"\",AVERAGE($BV$10:BV327))","v":""},null,{"$f":"IF(BV327=\"\",\"\",_xlfn.NORM.DIST(BV327,AVERAGE($BV$10:$BV$5000),Dashboard!$L$36,FALSE))","v":""},{"$nulls":5},{"$f":"IF(BV327=\"\",\"\",_xlfn.NORM.DIST(BV327,AVERAGE(BV327:BW5317),Dashboard!$L$36,FALSE))","v":""}]
[{"$nulls":49},"",{"$nulls":11},"",{"$nulls":11},"",{"$nulls":4},"",null,{"$f":"IF(BV328=\"\",\"\",AVERAGE($BV$10:BV328))","v":""},null,{"$f":"IF(BV328=\"\",\"\",_xlfn.NORM.DIST(BV328,AVERAGE($BV$10:$BV$5000),Dashboard!$L$36,FALSE))","v":""},{"$nulls":5},{"$f":"IF(BV328=\"\",\"\",_xlfn.NORM.DIST(BV328,AVERAGE(BV328:BW5318),Dashboard!$L$36,FALSE))","v":""}]
[{"$nulls":49},"",{"$nulls":11},"",{"$nulls":11},"",{"$nulls":4},"",null,{"$f":"IF(BV329=\"\",\"\",AVERAGE($BV$10:BV329))","v":""},null,{"$f":"IF(BV329=\"\",\"\",_xlfn.NORM.DIST(BV329,AVERAGE($BV$10:$BV$5000),Dashboard!$L$36,FALSE))","v":""},{"$nulls":5},{"$f":"IF(BV329=\"\",\"\",_xlfn.NORM.DIST(BV329,AVERAGE(BV329:BW5319),Dashboard!$L$36,FALSE))","v":""}]
[{"$nulls":49},"",{"$nulls":11},"",{"$nulls":11},"",{"$nulls":4},"",null,{"$f":"IF(BV330=\"\",\"\",AVERAGE($BV$10:BV330))","v":""},null,{"$f":"IF(BV330=\"\",\"\",_xlfn.NORM.DIST(BV330,AVERAGE($BV$10:$BV$5000),Dashboard!$L$36,FALSE))","v":""},{"$nulls":5},{"$f":"IF(BV330=\"\",\"\",_xlfn.NORM.DIST(BV330,AVERAGE(BV330:BW5320),Dashboard!$L$36,FALSE))","v":""}]
[{"$nulls":49},"",{"$nulls":11},"",{"$nulls":11},"",{"$nulls":4},"",null,{"$f":"IF(BV331=\"\",\"\",AVERAGE($BV$10:BV331))","v":""},null,{"$f":"IF(BV331=\"\",\"\",_xlfn.NORM.DIST(BV331,AVERAGE($BV$10:$BV$5000),Dashboard!$L$36,FALSE))","v":""},{"$nulls":5},{"$f":"IF(BV331=\"\",\"\",_xlfn.NORM.DIST(BV331,AVERAGE(BV331:BW5321),Dashboard!$L$36,FALSE))","v":""}]
[{"$nulls":49},"",{"$nulls":11},"",{"$nulls":11},"",{"$nulls":4},"",null,{"$f":"IF(BV332=\"\",\"\",AVERAGE($BV$10:BV332))","v":""},null,{"$f":"IF(BV332=\"\",\"\",_xlfn.NORM.DIST(BV332,AVERAGE($BV$10:$BV$5000),Dashboard!$L$36,FALSE))","v":""},{"$nulls":5},{"$f":"IF(BV332=\"\",\"\",_xlfn.NORM.DIST(BV332,AVERAGE(BV332:BW5322),Dashboard!$L$36,FALSE))","v":""}]
[{"$nulls":49},"",{"$nulls":11},"",{"$nulls":11},"",{"$nulls":4},"",null,{"$f":"IF(BV333=\"\",\"\",AVERAGE($BV$10:BV333))","v":""},null,{"$f":"IF(BV333=\"\",\"\",_xlfn.NORM.DIST(BV333,AVERAGE($BV$10:$BV$5000),Dashboard!$L$36,FALSE))","v":""},{"$nulls":5},{"$f":"IF(BV333=\"\",\"\",_xlfn.NORM.DIST(BV333,AVERAGE(BV333:BW5323),Dashboard!$L$36,FALSE))","v":""}]
[{"$nulls":49},"",{"$nulls":11},"",{"$nulls":11},"",{"$nulls":4},"",null,{"$f":"IF(BV334=\"\",\"\",AVERAGE($BV$10:BV334))","v":""},null,{"$f":"IF(BV334=\"\",\"\",_xlfn.NORM.DIST(BV334,AVERAGE($BV$10:$BV$5000),Dashboard!$L$36,FALSE))","v":""},{"$nulls":5},{"$f":"IF(BV334=\"\",\"\",_xlfn.NORM.DIST(BV334,AVERAGE(BV334:BW5324),Dashboard!$L$36,FALSE))","v":""}]
[{"$nulls":49},"",{"$nulls":11},"",{"$nulls":11},"",{"$nulls":4},"",null,{"$f":"IF(BV335=\"\",\"\",AVERAGE($BV$10:BV335))","v":""},null,{"$f":"IF(BV335=\"\",\"\",_xlfn.NORM.DIST(BV335,AVERAGE($BV$10:$BV$5000),Dashboard!$L$36,FALSE))","v":""},{"$nulls":5},{"$f":"IF(BV335=\"\",\"\",_xlfn.NORM.DIST(BV335,AVERAGE(BV335:BW5325),Dashboard!$L$36,FALSE))","v":""}]
[{"$nulls":49},"",{"$nulls":11},"",{"$nulls":11},"",{"$nulls":4},"",null,{"$f":"IF(BV336=\"\",\"\",AVERAGE($BV$10:BV336))","v":""},null,{"$f":"IF(BV336=\"\",\"\",_xlfn.NORM.DIST(BV336,AVERAGE($BV$10:$BV$5000),Dashboard!$L$36,FALSE))","v":""},{"$nulls":5},{"$f":"IF(BV336=\"\",\"\",_xlfn.NORM.DIST(BV336,AVERAGE(BV336:BW5326),Dashboard!$L$36,FALSE))","v":""}]
[{"$nulls":49},"",{"$nulls":11},"",{"$nulls":11},"",{"$nulls":4},"",null,{"$f":"IF(BV337=\"\",\"\",AVERAGE($BV$10:BV337))","v":""},null,{"$f":"IF(BV337=\"\",\"\",_xlfn.NORM.DIST(BV337,AVERAGE($BV$10:$BV$5000),Dashboard!$L$36,FALSE))","v":""},{"$nulls":5},{"$f":"IF(BV337=\"\",\"\",_xlfn.NORM.DIST(BV337,AVERAGE(BV337:BW5327),Dashboard!$L$36,FALSE))","v":""}]
[{"$nulls":49},"",{"$nulls":11},"",{"$nulls":11},"",{"$nulls":4},"",null,{"$f":"IF(BV338=\"\",\"\",AVERAGE($BV$10:BV338))","v":""},null,{"$f":"IF(BV338=\"\",\"\",_xlfn.NORM.DIST(BV338,AVERAGE($BV$10:$BV$5000),Dashboard!$L$36,FALSE))","v":""},{"$nulls":5},{"$f":"IF(BV338=\"\",\"\",_xlfn.NORM.DIST(BV338,AVERAGE(BV338:BW5328),Dashboard!$L$36,FALSE))","v":""}]
[{"$nulls":49},"",{"$nulls":11},"",{"$nulls":11},"",{"$nulls":4},"",null,{"$f":"IF(BV339=\"\",\"\",AVERAGE($BV$10:BV339))","v":""},null,{"$f":"IF(BV339=\"\",\"\",_xlfn.NORM.DIST(BV339,AVERAGE($BV$10:$BV$5000),Dashboard!$L$36,FALSE))","v":""},{"$nulls":5},{"$f":"IF(BV339=\"\",\"\",_xlfn.NORM.DIST(BV339,AVERAGE(BV339:BW5329),Dashboard!$L$36,FALSE))","v":""}]
[{"$nulls":49},"",{"$nulls":11},"",{"$nulls":11},"",{"$nulls":4},"",null,{"$f":"IF(BV340=\"\",\"\",AVERAGE($BV$10:BV340))","v":""},null,{"$f":"IF(BV340=\"\",\"\",_xlfn.NORM.DIST(BV340,AVERAGE($BV$10:$BV$5000),Dashboard!$L$36,FALSE))","v":""},{"$nulls":5},{"$f":"IF(BV340=\"\",\"\",_xlfn.NORM.DIST(BV340,AVERAGE(BV340:BW5330),Dashboard!$L$36,FALSE))","v":""}]
[{"$nulls":49},{"$f":"IF(SUM(AR341:AW341)=0,\"\",AVERAGE(AR341:AW341))","v":""},{"$nulls":11},{"$f":"IF(SUM(BD341:BI341)=0,\"\",AVERAGE(BD341:BI341))","v":""},{"$nulls":11},{"$f":"IF(SUM(BP341:BU341)=0,\"\",AVERAGE(BP341:BU341))","v":""},{"$nulls":4},{"$f":"IF(BV341=\"\",\"\",BV341-AJ341)","v":""},null,{"$f":"IF(BV341=\"\",\"\",AVERAGE($BV$10:BV341))","v":""},null,{"$f":"IF(BV341=\"\",\"\",_xlfn.NORM.DIST(BV341,AVERAGE($BV$10:$BV$5000),Dashboard!$L$36,FALSE))","v":""},{"$nulls":5},{"$f":"IF(BV341=\"\",\"\",_xlfn.NORM.DIST(BV341,AVERAGE(BV341:BW5331),Dashboard!$L$36,FALSE))","v":""}]
[{"$nulls":49},"",{"$nulls":11},"",{"$nulls":11},"",{"$nulls":4},"",null,{"$f":"IF(BV342=\"\",\"\",AVERAGE($BV$10:BV342))","v":""},null,{"$f":"IF(BV342=\"\",\"\",_xlfn.NORM.DIST(BV342,AVERAGE($BV$10:$BV$5000),Dashboard!$L$36,FALSE))","v":""},{"$nulls":5},{"$f":"IF(BV342=\"\",\"\",_xlfn.NORM.DIST(BV342,AVERAGE(BV342:BW5332),Dashboard!$L$36,FALSE))","v":""}]
[{"$nulls":49},"",{"$nulls":11},"",{"$nulls":11},"",{"$nulls":4},"",null,{"$f":"IF(BV343=\"\",\"\",AVERAGE($BV$10:BV343))","v":""},null,{"$f":"IF(BV343=\"\",\"\",_xlfn.NORM.DIST(BV343,AVERAGE($BV$10:$BV$5000),Dashboard!$L$36,FALSE))","v":""},{"$nulls":5},{"$f":"IF(BV343=\"\",\"\",_xlfn.NORM.DIST(BV343,AVERAGE(BV343:BW5333),Dashboard!$L$36,FALSE))","v":""}]
[{"$nulls":49},"",{"$nulls":11},"",{"$nulls":11},"",{"$nulls":4},"",null,{"$f":"IF(BV344=\"\",\"\",AVERAGE($BV$10:BV344))","v":""},null,{"$f":"IF(BV344=\"\",\"\",_xlfn.NORM.DIST(BV344,AVERAGE($BV$10:$BV$5000),Dashboard!$L$36,FALSE))","v":""},{"$nulls":5},{"$f":"IF(BV344=\"\",\"\",_xlfn.NORM.DIST(BV344,AVERAGE(BV344:BW5334),Dashboard!$L$36,FALSE))","v":""}]
[{"$nulls":49},"",{"$nulls":11},"",{"$nulls":11},"",{"$nulls":4},"",null,{"$f":"IF(BV345=\"\",\"\",AVERAGE($BV$10:BV345))","v":""},null,{"$f":"IF(BV345=\"\",\"\",_xlfn.NORM.DIST(BV345,AVERAGE($BV$10:$BV$5000),Dashboard!$L$36,FALSE))","v":""},{"$nulls":5},{"$f":"IF(BV345=\"\",\"\",_xlfn.NORM.DIST(BV345,AVERAGE(BV345:BW5335),Dashboard!$L$36,FALSE))","v":""}]
[{"$nulls":49},"",{"$nulls":11},"",{"$nulls":11},"",{"$nulls":4},"",null,{"$f":"IF(BV346=\"\",\"\",AVERAGE($BV$10:BV346))","v":""},null,{"$f":"IF(BV346=\"\",\"\",_xlfn.NORM.DIST(BV346,AVERAGE($BV$10:$BV$5000),Dashboard!$L$36,FALSE))","v":""},{"$nulls":5},{"$f":"IF(BV346=\"\",\"\",_xlfn.NORM.DIST(BV346,AVERAGE(BV346:BW5336),Dashboard!$L$36,FALSE))","v":""}]
[{"$nulls":49},"",{"$nulls":11},"",{"$nulls":11},"",{"$nulls":4},"",null,{"$f":"IF(BV347=\"\",\"\",AVERAGE($BV$10:BV347))","v":""},null,{"$f":"IF(BV347=\"\",\"\",_xlfn.NORM.DIST(BV347,AVERAGE($BV$10:$BV$5000),Dashboard!$L$36,FALSE))","v":""},{"$nulls":5},{"$f":"IF(BV347=\"\",\"\",_xlfn.NORM.DIST(BV347,AVERAGE(BV347:BW5337),Dashboard!$L$36,FALSE))","v":""}]
[{"$nulls":49},"",{"$nulls":11},"",{"$nulls":11},"",{"$nulls":4},"",null,{"$f":"IF(BV348=\"\",\"\",AVERAGE($BV$10:BV348))","v":""},null,{"$f":"IF(BV348=\"\",\"\",_xlfn.NORM.DIST(BV348,AVERAGE($BV$10:$BV$5000),Dashboard!$L$36,FALSE))","v":""},{"$nulls":5},{"$f":"IF(BV348=\"\",\"\",_xlfn.NORM.DIST(BV348,AVERAGE(BV348:BW5338),Dashboard!$L$36,FALSE))","v":""}]
[{"$nulls":49},"",{"$nulls":11},"",{"$nulls":11},"",{"$nulls":4},"",null,{"$f":"IF(BV349=\"\",\"\",AVERAGE($BV$10:BV349))","v":""},null,{"$f":"IF(BV349=\"\",\"\",_xlfn.NORM.DIST(BV349,AVERAGE($BV$10:$BV$5000),Dashboard!$L$36,FALSE))","v":""},{"$nulls":5},{"$f":"IF(BV349=\"\",\"\",_xlfn.NORM.DIST(BV349,AVERAGE(BV349:BW5339),Dashboard!$L$36,FALSE))","v":""}]
[{"$nulls":49},"",{"$nulls":11},"",{"$nulls":11},"",{"$nulls":4},"",null,{"$f":"IF(BV350=\"\",\"\",AVERAGE($BV$10:BV350))","v":""},null,{"$f":"IF(BV350=\"\",\"\",_xlfn.NORM.DIST(BV350,AVERAGE($BV$10:$BV$5000),Dashboard!$L$36,FALSE))","v":""},{"$nulls":5},{"$f":"IF(BV350=\"\",\"\",_xlfn.NORM.DIST(BV350,AVERAGE(BV350:BW5340),Dashboard!$L$36,FALSE))","v":""}]
[{"$nulls":49},"",{"$nulls":11},"",{"$nulls":11},"",{"$nulls":4},"",null,{"$f":"IF(BV351=\"\",\"\",AVERAGE($BV$10:BV351))","v":""},null,{"$f":"IF(BV351=\"\",\"\",_xlfn.NORM.DIST(BV351,AVERAGE($BV$10:$BV$5000),Dashboard!$L$36,FALSE))","v":""},{"$nulls":5},{"$f":"IF(BV351=\"\",\"\",_xlfn.NORM.DIST(BV351,AVERAGE(BV351:BW5341),Dashboard!$L$36,FALSE))","v":""}]
[{"$nulls":49},"",{"$nulls":11},"",{"$nulls":11},"",{"$nulls":4},"",null,{"$f":"IF(BV352=\"\",\"\",AVERAGE($BV$10:BV352))","v":""},null,{"$f":"IF(BV352=\"\",\"\",_xlfn.NORM.DIST(BV352,AVERAGE($BV$10:$BV$5000),Dashboard!$L$36,FALSE))","v":""},{"$nulls":5},{"$f":"IF(BV352=\"\",\"\",_xlfn.NORM.DIST(BV352,AVERAGE(BV352:BW5342),Dashboard!$L$36,FALSE))","v":""}]
[{"$nulls":49},"",{"$nulls":11},"",{"$nulls":11},"",{"$nulls":4},"",null,{"$f":"IF(BV353=\"\",\"\",AVERAGE($BV$10:BV353))","v":""},null,{"$f":"IF(BV353=\"\",\"\",_xlfn.NORM.DIST(BV353,AVERAGE($BV$10:$BV$5000),Dashboard!$L$36,FALSE))","v":""},{"$nulls":5},{"$f":"IF(BV353=\"\",\"\",_xlfn.NORM.DIST(BV353,AVERAGE(BV353:BW5343),Dashboard!$L$36,FALSE))","v":""}]
[{"$nulls":49},"",{"$nulls":11},"",{"$nulls":11},"",{"$nulls":4},"",null,{"$f":"IF(BV354=\"\",\"\",AVERAGE($BV$10:BV354))","v":""},null,{"$f":"IF(BV354=\"\",\"\",_xlfn.NORM.DIST(BV354,AVERAGE($BV$10:$BV$5000),Dashboard!$L$36,FALSE))","v":""},{"$nulls":5},{"$f":"IF(BV354=\"\",\"\",_xlfn.NORM.DIST(BV354,AVERAGE(BV354:BW5344),Dashboard!$L$36,FALSE))","v":""}]
[{"$nulls":49},"",{"$nulls":11},"",{"$nulls":11},"",{"$nulls":4},"",null,{"$f":"IF(BV355=\"\",\"\",AVERAGE($BV$10:BV355))","v":""},null,{"$f":"IF(BV355=\"\",\"\",_xlfn.NORM.DIST(BV355,AVERAGE($BV$10:$BV$5000),Dashboard!$L$36,FALSE))","v":""},{"$nulls":5},{"$f":"IF(BV355=\"\",\"\",_xlfn.NORM.DIST(BV355,AVERAGE(BV355:BW5345),Dashboard!$L$36,FALSE))","v":""}]
[{"$nulls":49},"",{"$nulls":11},"",{"$nulls":11},"",{"$nulls":4},"",null,{"$f":"IF(BV356=\"\",\"\",AVERAGE($BV$10:BV356))","v":""},null,{"$f":"IF(BV356=\"\",\"\",_xlfn.NORM.DIST(BV356,AVERAGE($BV$10:$BV$5000),Dashboard!$L$36,FALSE))","v":""},{"$nulls":5},{"$f":"IF(BV356=\"\",\"\",_xlfn.NORM.DIST(BV356,AVERAGE(BV356:BW5346),Dashboard!$L$36,FALSE))","v":""}]
[{"$nulls":49},"",{"$nulls":11},"",{"$nulls":11},"",{"$nulls":4},"",null,{"$f":"IF(BV357=\"\",\"\",AVERAGE($BV$10:BV357))","v":""},null,{"$f":"IF(BV357=\"\",\"\",_xlfn.NORM.DIST(BV357,AVERAGE($BV$10:$BV$5000),Dashboard!$L$36,FALSE))","v":""},{"$nulls":5},{"$f":"IF(BV357=\"\",\"\",_xlfn.NORM.DIST(BV357,AVERAGE(BV357:BW5347),Dashboard!$L$36,FALSE))","v":""}]
[{"$nulls":49},"",{"$nulls":11},"",{"$nulls":11},"",{"$nulls":4},"",null,{"$f":"IF(BV358=\"\",\"\",AVERAGE($BV$10:BV358))","v":""},null,{"$f":"IF(BV358=\"\",\"\",_xlfn.NORM.DIST(BV358,AVERAGE($BV$10:$BV$5000),Dashboard!$L$36,FALSE))","v":""},{"$nulls":5},{"$f":"IF(BV358=\"\",\"\",_xlfn.NORM.DIST(BV358,AVERAGE(BV358:BW5348),Dashboard!$L$36,FALSE))","v":""}]
[{"$nulls":49},"",{"$nulls":11},"",{"$nulls":11},"",{"$nulls":4},"",null,{"$f":"IF(BV359=\"\",\"\",AVERAGE($BV$10:BV359))","v":""},null,{"$f":"IF(BV359=\"\",\"\",_xlfn.NORM.DIST(BV359,AVERAGE($BV$10:$BV$5000),Dashboard!$L$36,FALSE))","v":""},{"$nulls":5},{"$f":"IF(BV359=\"\",\"\",_xlfn.NORM.DIST(BV359,AVERAGE(BV359:BW5349),Dashboard!$L$36,FALSE))","v":""}]
[{"$nulls":49},"",{"$nulls":11},"",{"$nulls":11},"",{"$nulls":4},"",null,{"$f":"IF(BV360=\"\",\"\",AVERAGE($BV$10:BV360))","v":""},null,{"$f":"IF(BV360=\"\",\"\",_xlfn.NORM.DIST(BV360,AVERAGE($BV$10:$BV$5000),Dashboard!$L$36,FALSE))","v":""},{"$nulls":5},{"$f":"IF(BV360=\"\",\"\",_xlfn.NORM.DIST(BV360,AVERAGE(BV360:BW5350),Dashboard!$L$36,FALSE))","v":""}]
[{"$nulls":49},"",{"$nulls":11},"",{"$nulls":11},"",{"$nulls":4},"",null,{"$f":"IF(BV361=\"\",\"\",AVERAGE($BV$10:BV361))","v":""},null,{"$f":"IF(BV361=\"\",\"\",_xlfn.NORM.DIST(BV361,AVERAGE($BV$10:$BV$5000),Dashboard!$L$36,FALSE))","v":""},{"$nulls":5},{"$f":"IF(BV361=\"\",\"\",_xlfn.NORM.DIST(BV361,AVERAGE(BV361:BW5351),Dashboard!$L$36,FALSE))","v":""}]
[{"$nulls":49},"",{"$nulls":11},"",{"$nulls":11},"",{"$nulls":4},"",null,{"$f":"IF(BV362=\"\",\"\",AVERAGE($BV$10:BV362))","v":""},null,{"$f":"IF(BV362=\"\",\"\",_xlfn.NORM.DIST(BV362,AVERAGE($BV$10:$BV$5000),Dashboard!$L$36,FALSE))","v":""},{"$nulls":5},{"$f":"IF(BV362=\"\",\"\",_xlfn.NORM.DIST(BV362,AVERAGE(BV362:BW5352),Dashboard!$L$36,FALSE))","v":""}]
[{"$nulls":49},"",{"$nulls":11},"",{"$nulls":11},"",{"$nulls":4},"",null,{"$f":"IF(BV363=\"\",\"\",AVERAGE($BV$10:BV363))","v":""},null,{"$f":"IF(BV363=\"\",\"\",_xlfn.NORM.DIST(BV363,AVERAGE($BV$10:$BV$5000),Dashboard!$L$36,FALSE))","v":""},{"$nulls":5},{"$f":"IF(BV363=\"\",\"\",_xlfn.NORM.DIST(BV363,AVERAGE(BV363:BW5353),Dashboard!$L$36,FALSE))","v":""}]
[{"$nulls":49},"",{"$nulls":11},"",{"$nulls":11},"",{"$nulls":4},"",null,{"$f":"IF(BV364=\"\",\"\",AVERAGE($BV$10:BV364))","v":""},null,{"$f":"IF(BV364=\"\",\"\",_xlfn.NORM.DIST(BV364,AVERAGE($BV$10:$BV$5000),Dashboard!$L$36,FALSE))","v":""},{"$nulls":5},{"$f":"IF(BV364=\"\",\"\",_xlfn.NORM.DIST(BV364,AVERAGE(BV364:BW5354),Dashboard!$L$36,FALSE))","v":""}]
[{"$nulls":49},"",{"$nulls":11},"",{"$nulls":11},"",{"$nulls":4},"",null,{"$f":"IF(BV365=\"\",\"\",AVERAGE($BV$10:BV365))","v":""},null,{"$f":"IF(BV365=\"\",\"\",_xlfn.NORM.DIST(BV365,AVERAGE($BV$10:$BV$5000),Dashboard!$L$36,FALSE))","v":""},{"$nulls":5},{"$f":"IF(BV365=\"\",\"\",_xlfn.NORM.DIST(BV365,AVERAGE(BV365:BW5355),Dashboard!$L$36,FALSE))","v":""}]
[{"$nulls":49},"",{"$nulls":11},"",{"$nulls":11},"",{"$nulls":4},"",null,{"$f":"IF(BV366=\"\",\"\",AVERAGE($BV$10:BV366))","v":""},null,{"$f":"IF(BV366=\"\",\"\",_xlfn.NORM.DIST(BV366,AVERAGE($BV$10:$BV$5000),Dashboard!$L$36,FALSE))","v":""},{"$nulls":5},{"$f":"IF(BV366=\"\",\"\",_xlfn.NORM.DIST(BV366,AVERAGE(BV366:BW5356),Dashboard!$L$36,FALSE))","v":""}]
[{"$nulls":49},"",{"$nulls":11},"",{"$nulls":11},"",{"$nulls":4},"",null,{"$f":"IF(BV367=\"\",\"\",AVERAGE($BV$10:BV367))","v":""},null,{"$f":"IF(BV367=\"\",\"\",_xlfn.NORM.DIST(BV367,AVERAGE($BV$10:$BV$5000),Dashboard!$L$36,FALSE))","v":""},{"$nulls":5},{"$f":"IF(BV367=\"\",\"\",_xlfn.NORM.DIST(BV367,AVERAGE(BV367:BW5357),Dashboard!$L$36,FALSE))","v":""}]
[{"$nulls":49},"",{"$nulls":11},"",{"$nulls":11},"",{"$nulls":4},"",null,{"$f":"IF(BV368=\"\",\"\",AVERAGE($BV$10:BV368))","v":""},null,{"$f":"IF(BV368=\"\",\"\",_xlfn.NORM.DIST(BV368,AVERAGE($BV$10:$BV$5000),Dashboard!$L$36,FALSE))","v":""},{"$nulls":5},{"$f":"IF(BV368=\"\",\"\",_xlfn.NORM.DIST(BV368,AVERAGE(BV368:BW5358),Dashboard!$L$36,FALSE))","v":""}]
[{"$nulls":49},"",{"$nulls":11},"",{"$nulls":11},"",{"$nulls":4},"",null,{"$f":"IF(BV369=\"\",\"\",AVERAGE($BV$10:BV369))","v":""},null,{"$f":"IF(BV369=\"\",\"\",_xlfn.NORM.DIST(BV369,AVERAGE($BV$10:$BV$5000),Dashboard!$L$36,FALSE))","v":""},{"$nulls":5},{"$f":"IF(BV369=\"\",\"\",_xlfn.NORM.DIST(BV369,AVERAGE(BV369:BW5359),Dashboard!$L$36,FALSE))","v":""}]
[{"$nulls":49},"",{"$nulls":11},"",{"$nulls":11},"",{"$nulls":4},"",null,{"$f":"IF(BV370=\"\",\"\",AVERAGE($BV$10:BV370))","v":""},null,{"$f":"IF(BV370=\"\",\"\",_xlfn.NORM.DIST(BV370,AVERAGE($BV$10:$BV$5000),Dashboard!$L$36,FALSE))","v":""},{"$nulls":5},{"$f":"IF(BV370=\"\",\"\",_xlfn.NORM.DIST(BV370,AVERAGE(BV370:BW5360),Dashboard!$L$36,FALSE))","v":""}]
[{"$nulls":49},"",{"$nulls":11},"",{"$nulls":11},"",{"$nulls":4},"",null,{"$f":"IF(BV371=\"\",\"\",AVERAGE($BV$10:BV371))","v":""},null,{"$f":"IF(BV371=\"\",\"\",_xlfn.NORM.DIST(BV371,AVERAGE($BV$10:$BV$5000),Dashboard!$L$36,FALSE))","v":""},{"$nulls":5},{"$f":"IF(BV371=\"\",\"\",_xlfn.NORM.DIST(BV371,AVERAGE(BV371:BW5361),Dashboard!$L$36,FALSE))","v":""}]
[{"$nulls":49},"",{"$nulls":11},"",{"$nulls":11},"",{"$nulls":4},"",null,{"$f":"IF(BV372=\"\",\"\",AVERAGE($BV$10:BV372))","v":""},null,{"$f":"IF(BV372=\"\",\"\",_xlfn.NORM.DIST(BV372,AVERAGE($BV$10:$BV$5000),Dashboard!$L$36,FALSE))","v":""},{"$nulls":5},{"$f":"IF(BV372=\"\",\"\",_xlfn.NORM.DIST(BV372,AVERAGE(BV372:BW5362),Dashboard!$L$36,FALSE))","v":""}]
[{"$nulls":49},"",{"$nulls":11},"",{"$nulls":11},"",{"$nulls":4},"",null,{"$f":"IF(BV373=\"\",\"\",AVERAGE($BV$10:BV373))","v":""},null,{"$f":"IF(BV373=\"\",\"\",_xlfn.NORM.DIST(BV373,AVERAGE($BV$10:$BV$5000),Dashboard!$L$36,FALSE))","v":""},{"$nulls":5},{"$f":"IF(BV373=\"\",\"\",_xlfn.NORM.DIST(BV373,AVERAGE(BV373:BW5363),Dashboard!$L$36,FALSE))","v":""}]
[{"$nulls":49},"",{"$nulls":11},"",{"$nulls":11},"",{"$nulls":4},"",null,{"$f":"IF(BV374=\"\",\"\",AVERAGE($BV$10:BV374))","v":""},null,{"$f":"IF(BV374=\"\",\"\",_xlfn.NORM.DIST(BV374,AVERAGE($BV$10:$BV$5000),Dashboard!$L$36,FALSE))","v":""},{"$nulls":5},{"$f":"IF(BV374=\"\",\"\",_xlfn.NORM.DIST(BV374,AVERAGE(BV374:BW5364),Dashboard!$L$36,FALSE))","v":""}]
[{"$nulls":49},"",{"$nulls":11},"",{"$nulls":11},"",{"$nulls":4},"",null,{"$f":"IF(BV375=\"\",\"\",AVERAGE($BV$10:BV375))","v":""},null,{"$f":"IF(BV375=\"\",\"\",_xlfn.NORM.DIST(BV375,AVERAGE($BV$10:$BV$5000),Dashboard!$L$36,FALSE))","v":""},{"$nulls":5},{"$f":"IF(BV375=\"\",\"\",_xlfn.NORM.DIST(BV375,AVERAGE(BV375:BW5365),Dashboard!$L$36,FALSE))","v":""}]
[{"$nulls":49},"",{"$nulls":11},"",{"$nulls":11},"",{"$nulls":4},"",null,{"$f":"IF(BV376=\"\",\"\",AVERAGE($BV$10:BV376))","v":""},null,{"$f":"IF(BV376=\"\",\"\",_xlfn.NORM.DIST(BV376,AVERAGE($BV$10:$BV$5000),Dashboard!$L$36,FALSE))","v":""},{"$nulls":5},{"$f":"IF(BV376=\"\",\"\",_xlfn.NORM.DIST(BV376,AVERAGE(BV376:BW5366),Dashboard!$L$36,FALSE))","v":""}]
[{"$nulls":49},"",{"$nulls":11},"",{"$nulls":11},"",{"$nulls":4},"",null,{"$f":"IF(BV377=\"\",\"\",AVERAGE($BV$10:BV377))","v":""},null,{"$f":"IF(BV377=\"\",\"\",_xlfn.NORM.DIST(BV377,AVERAGE($BV$10:$BV$5000),Dashboard!$L$36,FALSE))","v":""},{"$nulls":5},{"$f":"IF(BV377=\"\",\"\",_xlfn.NORM.DIST(BV377,AVERAGE(BV377:BW5367),Dashboard!$L$36,FALSE))","v":""}]
[{"$nulls":49},"",{"$nulls":11},"",{"$nulls":11},"",{"$nulls":4},"",null,{"$f":"IF(BV378=\"\",\"\",AVERAGE($BV$10:BV378))","v":""},null,{"$f":"IF(BV378=\"\",\"\",_xlfn.NORM.DIST(BV378,AVERAGE($BV$10:$BV$5000),Dashboard!$L$36,FALSE))","v":""},{"$nulls":5},{"$f":"IF(BV378=\"\",\"\",_xlfn.NORM.DIST(BV378,AVERAGE(BV378:BW5368),Dashboard!$L$36,FALSE))","v":""}]
[{"$nulls":49},"",{"$nulls":11},"",{"$nulls":11},"",{"$nulls":4},"",null,{"$f":"IF(BV379=\"\",\"\",AVERAGE($BV$10:BV379))","v":""},null,{"$f":"IF(BV379=\"\",\"\",_xlfn.NORM.DIST(BV379,AVERAGE($BV$10:$BV$5000),Dashboard!$L$36,FALSE))","v":""},{"$nulls":5},{"$f":"IF(BV379=\"\",\"\",_xlfn.NORM.DIST(BV379,AVERAGE(BV379:BW5369),Dashboard!$L$36,FALSE))","v":""}]
[{"$nulls":49},"",{"$nulls":11},"",{"$nulls":11},"",{"$nulls":4},"",null,{"$f":"IF(BV380=\"\",\"\",AVERAGE($BV$10:BV380))","v":""},null,{"$f":"IF(BV380=\"\",\"\",_xlfn.NORM.DIST(BV380,AVERAGE($BV$10:$BV$5000),Dashboard!$L$36,FALSE))","v":""},{"$nulls":5},{"$f":"IF(BV380=\"\",\"\",_xlfn.NORM.DIST(BV380,AVERAGE(BV380:BW5370),Dashboard!$L$36,FALSE))","v":""}]
[{"$nulls":49},"",{"$nulls":11},"",{"$nulls":11},"",{"$nulls":4},"",null,{"$f":"IF(BV381=\"\",\"\",AVERAGE($BV$10:BV381))","v":""},null,{"$f":"IF(BV381=\"\",\"\",_xlfn.NORM.DIST(BV381,AVERAGE($BV$10:$BV$5000),Dashboard!$L$36,FALSE))","v":""},{"$nulls":5},{"$f":"IF(BV381=\"\",\"\",_xlfn.NORM.DIST(BV381,AVERAGE(BV381:BW5371),Dashboard!$L$36,FALSE))","v":""}]
[{"$nulls":49},"",{"$nulls":11},"",{"$nulls":11},"",{"$nulls":4},"",null,{"$f":"IF(BV382=\"\",\"\",AVERAGE($BV$10:BV382))","v":""},null,{"$f":"IF(BV382=\"\",\"\",_xlfn.NORM.DIST(BV382,AVERAGE($BV$10:$BV$5000),Dashboard!$L$36,FALSE))","v":""},{"$nulls":5},{"$f":"IF(BV382=\"\",\"\",_xlfn.NORM.DIST(BV382,AVERAGE(BV382:BW5372),Dashboard!$L$36,FALSE))","v":""}]
[{"$nulls":49},"",{"$nulls":11},"",{"$nulls":11},"",{"$nulls":4},"",null,{"$f":"IF(BV383=\"\",\"\",AVERAGE($BV$10:BV383))","v":""},null,{"$f":"IF(BV383=\"\",\"\",_xlfn.NORM.DIST(BV383,AVERAGE($BV$10:$BV$5000),Dashboard!$L$36,FALSE))","v":""},{"$nulls":5},{"$f":"IF(BV383=\"\",\"\",_xlfn.NORM.DIST(BV383,AVERAGE(BV383:BW5373),Dashboard!$L$36,FALSE))","v":""}]
[{"$nulls":49},"",{"$nulls":11},"",{"$nulls":11},"",{"$nulls":4},"",null,{"$f":"IF(BV384=\"\",\"\",AVERAGE($BV$10:BV384))","v":""},null,{"$f":"IF(BV384=\"\",\"\",_xlfn.NORM.DIST(BV384,AVERAGE($BV$10:$BV$5000),Dashboard!$L$36,FALSE))","v":""},{"$nulls":5},{"$f":"IF(BV384=\"\",\"\",_xlfn.NORM.DIST(BV384,AVERAGE(BV384:BW5374),Dashboard!$L$36,FALSE))","v":""}]
[{"$nulls":49},"",{"$nulls":11},"",{"$nulls":11},"",{"$nulls":4},"",null,{"$f":"IF(BV385=\"\",\"\",AVERAGE($BV$10:BV385))","v":""},null,{"$f":"IF(BV385=\"\",\"\",_xlfn.NORM.DIST(BV385,AVERAGE($BV$10:$BV$5000),Dashboard!$L$36,FALSE))","v":""},{"$nulls":5},{"$f":"IF(BV385=\"\",\"\",_xlfn.NORM.DIST(BV385,AVERAGE(BV385:BW5375),Dashboard!$L$36,FALSE))","v":""}]
[{"$nulls":49},"",{"$nulls":11},"",{"$nulls":11},"",{"$nulls":4},"",null,{"$f":"IF(BV386=\"\",\"\",AVERAGE($BV$10:BV386))","v":""},null,{"$f":"IF(BV386=\"\",\"\",_xlfn.NORM.DIST(BV386,AVERAGE($BV$10:$BV$5000),Dashboard!$L$36,FALSE))","v":""},{"$nulls":5},{"$f":"IF(BV386=\"\",\"\",_xlfn.NORM.DIST(BV386,AVERAGE(BV386:BW5376),Dashboard!$L$36,FALSE))","v":""}]
[{"$nulls":49},"",{"$nulls":11},"",{"$nulls":11},"",{"$nulls":4},"",null,{"$f":"IF(BV387=\"\",\"\",AVERAGE($BV$10:BV387))","v":""},null,{"$f":"IF(BV387=\"\",\"\",_xlfn.NORM.DIST(BV387,AVERAGE($BV$10:$BV$5000),Dashboard!$L$36,FALSE))","v":""},{"$nulls":5},{"$f":"IF(BV387=\"\",\"\",_xlfn.NORM.DIST(BV387,AVERAGE(BV387:BW5377),Dashboard!$L$36,FALSE))","v":""}]
[{"$nulls":49},"",{"$nulls":11},"",{"$nulls":11},"",{"$nulls":4},"",null,{"$f":"IF(BV388=\"\",\"\",AVERAGE($BV$10:BV388))","v":""},null,{"$f":"IF(BV388=\"\",\"\",_xlfn.NORM.DIST(BV388,AVERAGE($BV$10:$BV$5000),Dashboard!$L$36,FALSE))","v":""},{"$nulls":5},{"$f":"IF(BV388=\"\",\"\",_xlfn.NORM.DIST(BV388,AVERAGE(BV388:BW5378),Dashboard!$L$36,FALSE))","v":""}]
[{"$nulls":49},"",{"$nulls":11},"",{"$nulls":11},"",{"$nulls":4},"",null,{"$f":"IF(BV389=\"\",\"\",AVERAGE($BV$10:BV389))","v":""},null,{"$f":"IF(BV389=\"\",\"\",_xlfn.NORM.DIST(BV389,AVERAGE($BV$10:$BV$5000),Dashboard!$L$36,FALSE))","v":""},{"$nulls":5},{"$f":"IF(BV389=\"\",\"\",_xlfn.NORM.DIST(BV389,AVERAGE(BV389:BW5379),Dashboard!$L$36,FALSE))","v":""}]
[{"$nulls":49},"",{"$nulls":11},"",{"$nulls":11},"",{"$nulls":4},"",null,{"$f":"IF(BV390=\"\",\"\",AVERAGE($BV$10:BV390))","v":""},null,{"$f":"IF(BV390=\"\",\"\",_xlfn.NORM.DIST(BV390,AVERAGE($BV$10:$BV$5000),Dashboard!$L$36,FALSE))","v":""},{"$nulls":5},{"$f":"IF(BV390=\"\",\"\",_xlfn.NORM.DIST(BV390,AVERAGE(BV390:BW5380),Dashboard!$L$36,FALSE))","v":""}]
[{"$nulls":49},"",{"$nulls":11},"",{"$nulls":11},"",{"$nulls":4},"",null,{"$f":"IF(BV391=\"\",\"\",AVERAGE($BV$10:BV391))","v":""},null,{"$f":"IF(BV391=\"\",\"\",_xlfn.NORM.DIST(BV391,AVERAGE($BV$10:$BV$5000),Dashboard!$L$36,FALSE))","v":""},{"$nulls":5},{"$f":"IF(BV391=\"\",\"\",_xlfn.NORM.DIST(BV391,AVERAGE(BV391:BW5381),Dashboard!$L$36,FALSE))","v":""}]
[{"$nulls":49},"",{"$nulls":11},"",{"$nulls":11},"",{"$nulls":4},"",null,{"$f":"IF(BV392=\"\",\"\",AVERAGE($BV$10:BV392))","v":""},null,{"$f":"IF(BV392=\"\",\"\",_xlfn.NORM.DIST(BV392,AVERAGE($BV$10:$BV$5000),Dashboard!$L$36,FALSE))","v":""},{"$nulls":5},{"$f":"IF(BV392=\"\",\"\",_xlfn.NORM.DIST(BV392,AVERAGE(BV392:BW5382),Dashboard!$L$36,FALSE))","v":""}]
[{"$nulls":49},"",{"$nulls":11},"",{"$nulls":11},"",{"$nulls":4},"",null,{"$f":"IF(BV393=\"\",\"\",AVERAGE($BV$10:BV393))","v":""},null,{"$f":"IF(BV393=\"\",\"\",_xlfn.NORM.DIST(BV393,AVERAGE($BV$10:$BV$5000),Dashboard!$L$36,FALSE))","v":""},{"$nulls":5},{"$f":"IF(BV393=\"\",\"\",_xlfn.NORM.DIST(BV393,AVERAGE(BV393:BW5383),Dashboard!$L$36,FALSE))","v":""}]
[{"$nulls":49},"",{"$nulls":11},"",{"$nulls":11},"",{"$nulls":4},"",null,{"$f":"IF(BV394=\"\",\"\",AVERAGE($BV$10:BV394))","v":""},null,{"$f":"IF(BV394=\"\",\"\",_xlfn.NORM.DIST(BV394,AVERAGE($BV$10:$BV$5000),Dashboard!$L$36,FALSE))","v":""},{"$nulls":5},{"$f":"IF(BV394=\"\",\"\",_xlfn.NORM.DIST(BV394,AVERAGE(BV394:BW5384),Dashboard!$L$36,FALSE))","v":""}]
[{"$nulls":49},"",{"$nulls":11},"",{"$nulls":11},"",{"$nulls":4},"",null,{"$f":"IF(BV395=\"\",\"\",AVERAGE($BV$10:BV395))","v":""},null,{"$f":"IF(BV395=\"\",\"\",_xlfn.NORM.DIST(BV395,AVERAGE($BV$10:$BV$5000),Dashboard!$L$36,FALSE))","v":""},{"$nulls":5},{"$f":"IF(BV395=\"\",\"\",_xlfn.NORM.DIST(BV395,AVERAGE(BV395:BW5385),Dashboard!$L$36,FALSE))","v":""}]
[{"$nulls":49},"",{"$nulls":11},"",{"$nulls":11},"",{"$nulls":4},"",null,{"$f":"IF(BV396=\"\",\"\",AVERAGE($BV$10:BV396))","v":""},null,{"$f":"IF(BV396=\"\",\"\",_xlfn.NORM.DIST(BV396,AVERAGE($BV$10:$BV$5000),Dashboard!$L$36,FALSE))","v":""},{"$nulls":5},{"$f":"IF(BV396=\"\",\"\",_xlfn.NORM.DIST(BV396,AVERAGE(BV396:BW5386),Dashboard!$L$36,FALSE))","v":""}]
[{"$nulls":49},"",{"$nulls":11},"",{"$nulls":11},"",{"$nulls":4},"",null,{"$f":"IF(BV397=\"\",\"\",AVERAGE($BV$10:BV397))","v":""},null,{"$f":"IF(BV397=\"\",\"\",_xlfn.NORM.DIST(BV397,AVERAGE($BV$10:$BV$5000),Dashboard!$L$36,FALSE))","v":""},{"$nulls":5},{"$f":"IF(BV397=\"\",\"\",_xlfn.NORM.DIST(BV397,AVERAGE(BV397:BW5387),Dashboard!$L$36,FALSE))","v":""}]
[{"$nulls":49},"",{"$nulls":11},"",{"$nulls":11},"",{"$nulls":4},"",null,{"$f":"IF(BV398=\"\",\"\",AVERAGE($BV$10:BV398))","v":""},null,{"$f":"IF(BV398=\"\",\"\",_xlfn.NORM.DIST(BV398,AVERAGE($BV$10:$BV$5000),Dashboard!$L$36,FALSE))","v":""},{"$nulls":5},{"$f":"IF(BV398=\"\",\"\",_xlfn.NORM.DIST(BV398,AVERAGE(BV398:BW5388),Dashboard!$L$36,FALSE))","v":""}]
[{"$nulls":49},"",{"$nulls":11},"",{"$nulls":11},"",{"$nulls":4},"",null,{"$f":"IF(BV399=\"\",\"\",AVERAGE($BV$10:BV399))","v":""},null,{"$f":"IF(BV399=\"\",\"\",_xlfn.NORM.DIST(BV399,AVERAGE($BV$10:$BV$5000),Dashboard!$L$36,FALSE))","v":""},{"$nulls":5},{"$f":"IF(BV399=\"\",\"\",_xlfn.NORM.DIST(BV399,AVERAGE(BV399:BW5389),Dashboard!$L$36,FALSE))","v":""}]
[{"$nulls":49},"",{"$nulls":11},"",{"$nulls":11},"",{"$nulls":4},"",null,{"$f":"IF(BV400=\"\",\"\",AVERAGE($BV$10:BV400))","v":""},null,{"$f":"IF(BV400=\"\",\"\",_xlfn.NORM.DIST(BV400,AVERAGE($BV$10:$BV$5000),Dashboard!$L$36,FALSE))","v":""},{"$nulls":5},{"$f":"IF(BV400=\"\",\"\",_xlfn.NORM.DIST(BV400,AVERAGE(BV400:BW5390),Dashboard!$L$36,FALSE))","v":""}]
[{"$nulls":49},"",{"$nulls":11},"",{"$nulls":11},"",{"$nulls":4},"",null,{"$f":"IF(BV401=\"\",\"\",AVERAGE($BV$10:BV401))","v":""},null,{"$f":"IF(BV401=\"\",\"\",_xlfn.NORM.DIST(BV401,AVERAGE($BV$10:$BV$5000),Dashboard!$L$36,FALSE))","v":""},{"$nulls":5},{"$f":"IF(BV401=\"\",\"\",_xlfn.NORM.DIST(BV401,AVERAGE(BV401:BW5391),Dashboard!$L$36,FALSE))","v":""}]
[{"$nulls":49},"",{"$nulls":11},"",{"$nulls":11},"",{"$nulls":4},"",null,{"$f":"IF(BV402=\"\",\"\",AVERAGE($BV$10:BV402))","v":""},null,{"$f":"IF(BV402=\"\",\"\",_xlfn.NORM.DIST(BV402,AVERAGE($BV$10:$BV$5000),Dashboard!$L$36,FALSE))","v":""},{"$nulls":5},{"$f":"IF(BV402=\"\",\"\",_xlfn.NORM.DIST(BV402,AVERAGE(BV402:BW5392),Dashboard!$L$36,FALSE))","v":""}]
[{"$nulls":49},"",{"$nulls":11},"",{"$nulls":11},"",{"$nulls":4},"",null,{"$f":"IF(BV403=\"\",\"\",AVERAGE($BV$10:BV403))","v":""},null,{"$f":"IF(BV403=\"\",\"\",_xlfn.NORM.DIST(BV403,AVERAGE($BV$10:$BV$5000),Dashboard!$L$36,FALSE))","v":""},{"$nulls":5},{"$f":"IF(BV403=\"\",\"\",_xlfn.NORM.DIST(BV403,AVERAGE(BV403:BW5393),Dashboard!$L$36,FALSE))","v":""}]
[{"$nulls":49},"",{"$nulls":11},"",{"$nulls":11},"",{"$nulls":4},"",null,{"$f":"IF(BV404=\"\",\"\",AVERAGE($BV$10:BV404))","v":""},null,{"$f":"IF(BV404=\"\",\"\",_xlfn.NORM.DIST(BV404,AVERAGE($BV$10:$BV$5000),Dashboard!$L$36,FALSE))","v":""},{"$nulls":5},{"$f":"IF(BV404=\"\",\"\",_xlfn.NORM.DIST(BV404,AVERAGE(BV404:BW5394),Dashboard!$L$36,FALSE))","v":""}]
[{"$nulls":49},{"$f":"IF(SUM(AR405:AW405)=0,\"\",AVERAGE(AR405:AW405))","v":""},{"$nulls":11},{"$f":"IF(SUM(BD405:BI405)=0,\"\",AVERAGE(BD405:BI405))","v":""},{"$nulls":11},{"$f":"IF(SUM(BP405:BU405)=0,\"\",AVERAGE(BP405:BU405))","v":""},{"$nulls":4},{"$f":"IF(BV405=\"\",\"\",BV405-AJ405)","v":""},null,{"$f":"IF(BV405=\"\",\"\",AVERAGE($BV$10:BV405))","v":""},null,{"$f":"IF(BV405=\"\",\"\",_xlfn.NORM.DIST(BV405,AVERAGE($BV$10:$BV$5000),Dashboard!$L$36,FALSE))","v":""},{"$nulls":5},{"$f":"IF(BV405=\"\",\"\",_xlfn.NORM.DIST(BV405,AVERAGE(BV405:BW5395),Dashboard!$L$36,FALSE))","v":""}]
[{"$nulls":49},"",{"$nulls":11},"",{"$nulls":11},"",{"$nulls":4},"",null,{"$f":"IF(BV406=\"\",\"\",AVERAGE($BV$10:BV406))","v":""},null,{"$f":"IF(BV406=\"\",\"\",_xlfn.NORM.DIST(BV406,AVERAGE($BV$10:$BV$5000),Dashboard!$L$36,FALSE))","v":""},{"$nulls":5},{"$f":"IF(BV406=\"\",\"\",_xlfn.NORM.DIST(BV406,AVERAGE(BV406:BW5396),Dashboard!$L$36,FALSE))","v":""}]
[{"$nulls":49},"",{"$nulls":11},"",{"$nulls":11},"",{"$nulls":4},"",null,{"$f":"IF(BV407=\"\",\"\",AVERAGE($BV$10:BV407))","v":""},null,{"$f":"IF(BV407=\"\",\"\",_xlfn.NORM.DIST(BV407,AVERAGE($BV$10:$BV$5000),Dashboard!$L$36,FALSE))","v":""},{"$nulls":5},{"$f":"IF(BV407=\"\",\"\",_xlfn.NORM.DIST(BV407,AVERAGE(BV407:BW5397),Dashboard!$L$36,FALSE))","v":""}]
[{"$nulls":49},"",{"$nulls":11},"",{"$nulls":11},"",{"$nulls":4},"",null,{"$f":"IF(BV408=\"\",\"\",AVERAGE($BV$10:BV408))","v":""},null,{"$f":"IF(BV408=\"\",\"\",_xlfn.NORM.DIST(BV408,AVERAGE($BV$10:$BV$5000),Dashboard!$L$36,FALSE))","v":""},{"$nulls":5},{"$f":"IF(BV408=\"\",\"\",_xlfn.NORM.DIST(BV408,AVERAGE(BV408:BW5398),Dashboard!$L$36,FALSE))","v":""}]
[{"$nulls":49},"",{"$nulls":11},"",{"$nulls":11},"",{"$nulls":4},"",null,{"$f":"IF(BV409=\"\",\"\",AVERAGE($BV$10:BV409))","v":""},null,{"$f":"IF(BV409=\"\",\"\",_xlfn.NORM.DIST(BV409,AVERAGE($BV$10:$BV$5000),Dashboard!$L$36,FALSE))","v":""},{"$nulls":5},{"$f":"IF(BV409=\"\",\"\",_xlfn.NORM.DIST(BV409,AVERAGE(BV409:BW5399),Dashboard!$L$36,FALSE))","v":""}]
[{"$nulls":49},"",{"$nulls":11},"",{"$nulls":11},"",{"$nulls":4},"",null,{"$f":"IF(BV410=\"\",\"\",AVERAGE($BV$10:BV410))","v":""},null,{"$f":"IF(BV410=\"\",\"\",_xlfn.NORM.DIST(BV410,AVERAGE($BV$10:$BV$5000),Dashboard!$L$36,FALSE))","v":""},{"$nulls":5},{"$f":"IF(BV410=\"\",\"\",_xlfn.NORM.DIST(BV410,AVERAGE(BV410:BW5400),Dashboard!$L$36,FALSE))","v":""}]
[{"$nulls":49},"",{"$nulls":11},"",{"$nulls":11},"",{"$nulls":4},"",null,{"$f":"IF(BV411=\"\",\"\",AVERAGE($BV$10:BV411))","v":""},null,{"$f":"IF(BV411=\"\",\"\",_xlfn.NORM.DIST(BV411,AVERAGE($BV$10:$BV$5000),Dashboard!$L$36,FALSE))","v":""},{"$nulls":5},{"$f":"IF(BV411=\"\",\"\",_xlfn.NORM.DIST(BV411,AVERAGE(BV411:BW5401),Dashboard!$L$36,FALSE))","v":""}]
[{"$nulls":49},"",{"$nulls":11},"",{"$nulls":11},"",{"$nulls":4},"",null,{"$f":"IF(BV412=\"\",\"\",AVERAGE($BV$10:BV412))","v":""},null,{"$f":"IF(BV412=\"\",\"\",_xlfn.NORM.DIST(BV412,AVERAGE($BV$10:$BV$5000),Dashboard!$L$36,FALSE))","v":""},{"$nulls":5},{"$f":"IF(BV412=\"\",\"\",_xlfn.NORM.DIST(BV412,AVERAGE(BV412:BW5402),Dashboard!$L$36,FALSE))","v":""}]
[{"$nulls":49},"",{"$nulls":11},"",{"$nulls":11},"",{"$nulls":4},"",null,{"$f":"IF(BV413=\"\",\"\",AVERAGE($BV$10:BV413))","v":""},null,{"$f":"IF(BV413=\"\",\"\",_xlfn.NORM.DIST(BV413,AVERAGE($BV$10:$BV$5000),Dashboard!$L$36,FALSE))","v":""},{"$nulls":5},{"$f":"IF(BV413=\"\",\"\",_xlfn.NORM.DIST(BV413,AVERAGE(BV413:BW5403),Dashboard!$L$36,FALSE))","v":""}]
[{"$nulls":49},"",{"$nulls":11},"",{"$nulls":11},"",{"$nulls":4},"",null,{"$f":"IF(BV414=\"\",\"\",AVERAGE($BV$10:BV414))","v":""},null,{"$f":"IF(BV414=\"\",\"\",_xlfn.NORM.DIST(BV414,AVERAGE($BV$10:$BV$5000),Dashboard!$L$36,FALSE))","v":""},{"$nulls":5},{"$f":"IF(BV414=\"\",\"\",_xlfn.NORM.DIST(BV414,AVERAGE(BV414:BW5404),Dashboard!$L$36,FALSE))","v":""}]
[{"$nulls":49},"",{"$nulls":11},"",{"$nulls":11},"",{"$nulls":4},"",null,{"$f":"IF(BV415=\"\",\"\",AVERAGE($BV$10:BV415))","v":""},null,{"$f":"IF(BV415=\"\",\"\",_xlfn.NORM.DIST(BV415,AVERAGE($BV$10:$BV$5000),Dashboard!$L$36,FALSE))","v":""},{"$nulls":5},{"$f":"IF(BV415=\"\",\"\",_xlfn.NORM.DIST(BV415,AVERAGE(BV415:BW5405),Dashboard!$L$36,FALSE))","v":""}]
[{"$nulls":49},"",{"$nulls":11},"",{"$nulls":11},"",{"$nulls":4},"",null,{"$f":"IF(BV416=\"\",\"\",AVERAGE($BV$10:BV416))","v":""},null,{"$f":"IF(BV416=\"\",\"\",_xlfn.NORM.DIST(BV416,AVERAGE($BV$10:$BV$5000),Dashboard!$L$36,FALSE))","v":""},{"$nulls":5},{"$f":"IF(BV416=\"\",\"\",_xlfn.NORM.DIST(BV416,AVERAGE(BV416:BW5406),Dashboard!$L$36,FALSE))","v":""}]
[{"$nulls":49},"",{"$nulls":11},"",{"$nulls":11},"",{"$nulls":4},"",null,{"$f":"IF(BV417=\"\",\"\",AVERAGE($BV$10:BV417))","v":""},null,{"$f":"IF(BV417=\"\",\"\",_xlfn.NORM.DIST(BV417,AVERAGE($BV$10:$BV$5000),Dashboard!$L$36,FALSE))","v":""},{"$nulls":5},{"$f":"IF(BV417=\"\",\"\",_xlfn.NORM.DIST(BV417,AVERAGE(BV417:BW5407),Dashboard!$L$36,FALSE))","v":""}]
[{"$nulls":49},"",{"$nulls":11},"",{"$nulls":11},"",{"$nulls":4},"",null,{"$f":"IF(BV418=\"\",\"\",AVERAGE($BV$10:BV418))","v":""},null,{"$f":"IF(BV418=\"\",\"\",_xlfn.NORM.DIST(BV418,AVERAGE($BV$10:$BV$5000),Dashboard!$L$36,FALSE))","v":""},{"$nulls":5},{"$f":"IF(BV418=\"\",\"\",_xlfn.NORM.DIST(BV418,AVERAGE(BV418:BW5408),Dashboard!$L$36,FALSE))","v":""}]
[{"$nulls":49},"",{"$nulls":11},"",{"$nulls":11},"",{"$nulls":4},"",null,{"$f":"IF(BV419=\"\",\"\",AVERAGE($BV$10:BV419))","v":""},null,{"$f":"IF(BV419=\"\",\"\",_xlfn.NORM.DIST(BV419,AVERAGE($BV$10:$BV$5000),Dashboard!$L$36,FALSE))","v":""},{"$nulls":5},{"$f":"IF(BV419=\"\",\"\",_xlfn.NORM.DIST(BV419,AVERAGE(BV419:BW5409),Dashboard!$L$36,FALSE))","v":""}]
[{"$nulls":49},"",{"$nulls":11},"",{"$nulls":11},"",{"$nulls":4},"",null,{"$f":"IF(BV420=\"\",\"\",AVERAGE($BV$10:BV420))","v":""},null,{"$f":"IF(BV420=\"\",\"\",_xlfn.NORM.DIST(BV420,AVERAGE($BV$10:$BV$5000),Dashboard!$L$36,FALSE))","v":""},{"$nulls":5},{"$f":"IF(BV420=\"\",\"\",_xlfn.NORM.DIST(BV420,AVERAGE(BV420:BW5410),Dashboard!$L$36,FALSE))","v":""}]
[{"$nulls":49},"",{"$nulls":11},"",{"$nulls":11},"",{"$nulls":4},"",null,{"$f":"IF(BV421=\"\",\"\",AVERAGE($BV$10:BV421))","v":""},null,{"$f":"IF(BV421=\"\",\"\",_xlfn.NORM.DIST(BV421,AVERAGE($BV$10:$BV$5000),Dashboard!$L$36,FALSE))","v":""},{"$nulls":5},{"$f":"IF(BV421=\"\",\"\",_xlfn.NORM.DIST(BV421,AVERAGE(BV421:BW5411),Dashboard!$L$36,FALSE))","v":""}]
[{"$nulls":49},"",{"$nulls":11},"",{"$nulls":11},"",{"$nulls":4},"",null,{"$f":"IF(BV422=\"\",\"\",AVERAGE($BV$10:BV422))","v":""},null,{"$f":"IF(BV422=\"\",\"\",_xlfn.NORM.DIST(BV422,AVERAGE($BV$10:$BV$5000),Dashboard!$L$36,FALSE))","v":""},{"$nulls":5},{"$f":"IF(BV422=\"\",\"\",_xlfn.NORM.DIST(BV422,AVERAGE(BV422:BW5412),Dashboard!$L$36,FALSE))","v":""}]
[{"$nulls":49},"",{"$nulls":11},"",{"$nulls":11},"",{"$nulls":4},"",null,{"$f":"IF(BV423=\"\",\"\",AVERAGE($BV$10:BV423))","v":""},null,{"$f":"IF(BV423=\"\",\"\",_xlfn.NORM.DIST(BV423,AVERAGE($BV$10:$BV$5000),Dashboard!$L$36,FALSE))","v":""},{"$nulls":5},{"$f":"IF(BV423=\"\",\"\",_xlfn.NORM.DIST(BV423,AVERAGE(BV423:BW5413),Dashboard!$L$36,FALSE))","v":""}]
[{"$nulls":49},"",{"$nulls":11},"",{"$nulls":11},"",{"$nulls":4},"",null,{"$f":"IF(BV424=\"\",\"\",AVERAGE($BV$10:BV424))","v":""},null,{"$f":"IF(BV424=\"\",\"\",_xlfn.NORM.DIST(BV424,AVERAGE($BV$10:$BV$5000),Dashboard!$L$36,FALSE))","v":""},{"$nulls":5},{"$f":"IF(BV424=\"\",\"\",_xlfn.NORM.DIST(BV424,AVERAGE(BV424:BW5414),Dashboard!$L$36,FALSE))","v":""}]
[{"$nulls":49},"",{"$nulls":11},"",{"$nulls":11},"",{"$nulls":4},"",null,{"$f":"IF(BV425=\"\",\"\",AVERAGE($BV$10:BV425))","v":""},null,{"$f":"IF(BV425=\"\",\"\",_xlfn.NORM.DIST(BV425,AVERAGE($BV$10:$BV$5000),Dashboard!$L$36,FALSE))","v":""},{"$nulls":5},{"$f":"IF(BV425=\"\",\"\",_xlfn.NORM.DIST(BV425,AVERAGE(BV425:BW5415),Dashboard!$L$36,FALSE))","v":""}]
[{"$nulls":49},"",{"$nulls":11},"",{"$nulls":11},"",{"$nulls":4},"",null,{"$f":"IF(BV426=\"\",\"\",AVERAGE($BV$10:BV426))","v":""},null,{"$f":"IF(BV426=\"\",\"\",_xlfn.NORM.DIST(BV426,AVERAGE($BV$10:$BV$5000),Dashboard!$L$36,FALSE))","v":""},{"$nulls":5},{"$f":"IF(BV426=\"\",\"\",_xlfn.NORM.DIST(BV426,AVERAGE(BV426:BW5416),Dashboard!$L$36,FALSE))","v":""}]
[{"$nulls":49},"",{"$nulls":11},"",{"$nulls":11},"",{"$nulls":4},"",null,{"$f":"IF(BV427=\"\",\"\",AVERAGE($BV$10:BV427))","v":""},null,{"$f":"IF(BV427=\"\",\"\",_xlfn.NORM.DIST(BV427,AVERAGE($BV$10:$BV$5000),Dashboard!$L$36,FALSE))","v":""},{"$nulls":5},{"$f":"IF(BV427=\"\",\"\",_xlfn.NORM.DIST(BV427,AVERAGE(BV427:BW5417),Dashboard!$L$36,FALSE))","v":""}]
[{"$nulls":49},"",{"$nulls":11},"",{"$nulls":11},"",{"$nulls":4},"",null,{"$f":"IF(BV428=\"\",\"\",AVERAGE($BV$10:BV428))","v":""},null,{"$f":"IF(BV428=\"\",\"\",_xlfn.NORM.DIST(BV428,AVERAGE($BV$10:$BV$5000),Dashboard!$L$36,FALSE))","v":""},{"$nulls":5},{"$f":"IF(BV428=\"\",\"\",_xlfn.NORM.DIST(BV428,AVERAGE(BV428:BW5418),Dashboard!$L$36,FALSE))","v":""}]
[{"$nulls":49},"",{"$nulls":11},"",{"$nulls":11},"",{"$nulls":4},"",null,{"$f":"IF(BV429=\"\",\"\",AVERAGE($BV$10:BV429))","v":""},null,{"$f":"IF(BV429=\"\",\"\",_xlfn.NORM.DIST(BV429,AVERAGE($BV$10:$BV$5000),Dashboard!$L$36,FALSE))","v":""},{"$nulls":5},{"$f":"IF(BV429=\"\",\"\",_xlfn.NORM.DIST(BV429,AVERAGE(BV429:BW5419),Dashboard!$L$36,FALSE))","v":""}]
[{"$nulls":49},"",{"$nulls":11},"",{"$nulls":11},"",{"$nulls":4},"",null,{"$f":"IF(BV430=\"\",\"\",AVERAGE($BV$10:BV430))","v":""},null,{"$f":"IF(BV430=\"\",\"\",_xlfn.NORM.DIST(BV430,AVERAGE($BV$10:$BV$5000),Dashboard!$L$36,FALSE))","v":""},{"$nulls":5},{"$f":"IF(BV430=\"\",\"\",_xlfn.NORM.DIST(BV430,AVERAGE(BV430:BW5420),Dashboard!$L$36,FALSE))","v":""}]
[{"$nulls":49},"",{"$nulls":11},"",{"$nulls":11},"",{"$nulls":4},"",null,{"$f":"IF(BV431=\"\",\"\",AVERAGE($BV$10:BV431))","v":""},null,{"$f":"IF(BV431=\"\",\"\",_xlfn.NORM.DIST(BV431,AVERAGE($BV$10:$BV$5000),Dashboard!$L$36,FALSE))","v":""},{"$nulls":5},{"$f":"IF(BV431=\"\",\"\",_xlfn.NORM.DIST(BV431,AVERAGE(BV431:BW5421),Dashboard!$L$36,FALSE))","v":""}]
[{"$nulls":49},"",{"$nulls":11},"",{"$nulls":11},"",{"$nulls":4},"",null,{"$f":"IF(BV432=\"\",\"\",AVERAGE($BV$10:BV432))","v":""},null,{"$f":"IF(BV432=\"\",\"\",_xlfn.NORM.DIST(BV432,AVERAGE($BV$10:$BV$5000),Dashboard!$L$36,FALSE))","v":""},{"$nulls":5},{"$f":"IF(BV432=\"\",\"\",_xlfn.NORM.DIST(BV432,AVERAGE(BV432:BW5422),Dashboard!$L$36,FALSE))","v":""}]
[{"$nulls":49},"",{"$nulls":11},"",{"$nulls":11},"",{"$nulls":4},"",null,{"$f":"IF(BV433=\"\",\"\",AVERAGE($BV$10:BV433))","v":""},null,{"$f":"IF(BV433=\"\",\"\",_xlfn.NORM.DIST(BV433,AVERAGE($BV$10:$BV$5000),Dashboard!$L$36,FALSE))","v":""},{"$nulls":5},{"$f":"IF(BV433=\"\",\"\",_xlfn.NORM.DIST(BV433,AVERAGE(BV433:BW5423),Dashboard!$L$36,FALSE))","v":""}]
[{"$nulls":49},"",{"$nulls":11},"",{"$nulls":11},"",{"$nulls":4},"",null,{"$f":"IF(BV434=\"\",\"\",AVERAGE($BV$10:BV434))","v":""},null,{"$f":"IF(BV434=\"\",\"\",_xlfn.NORM.DIST(BV434,AVERAGE($BV$10:$BV$5000),Dashboard!$L$36,FALSE))","v":""},{"$nulls":5},{"$f":"IF(BV434=\"\",\"\",_xlfn.NORM.DIST(BV434,AVERAGE(BV434:BW5424),Dashboard!$L$36,FALSE))","v":""}]
[{"$nulls":49},"",{"$nulls":11},"",{"$nulls":11},"",{"$nulls":4},"",null,{"$f":"IF(BV435=\"\",\"\",AVERAGE($BV$10:BV435))","v":""},null,{"$f":"IF(BV435=\"\",\"\",_xlfn.NORM.DIST(BV435,AVERAGE($BV$10:$BV$5000),Dashboard!$L$36,FALSE))","v":""},{"$nulls":5},{"$f":"IF(BV435=\"\",\"\",_xlfn.NORM.DIST(BV435,AVERAGE(BV435:BW5425),Dashboard!$L$36,FALSE))","v":""}]
[{"$nulls":49},"",{"$nulls":11},"",{"$nulls":11},"",{"$nulls":4},"",null,{"$f":"IF(BV436=\"\",\"\",AVERAGE($BV$10:BV436))","v":""},null,{"$f":"IF(BV436=\"\",\"\",_xlfn.NORM.DIST(BV436,AVERAGE($BV$10:$BV$5000),Dashboard!$L$36,FALSE))","v":""},{"$nulls":5},{"$f":"IF(BV436=\"\",\"\",_xlfn.NORM.DIST(BV436,AVERAGE(BV436:BW5426),Dashboard!$L$36,FALSE))","v":""}]
[{"$nulls":49},"",{"$nulls":11},"",{"$nulls":11},"",{"$nulls":4},"",null,{"$f":"IF(BV437=\"\",\"\",AVERAGE($BV$10:BV437))","v":""},null,{"$f":"IF(BV437=\"\",\"\",_xlfn.NORM.DIST(BV437,AVERAGE($BV$10:$BV$5000),Dashboard!$L$36,FALSE))","v":""},{"$nulls":5},{"$f":"IF(BV437=\"\",\"\",_xlfn.NORM.DIST(BV437,AVERAGE(BV437:BW5427),Dashboard!$L$36,FALSE))","v":""}]
[{"$nulls":49},"",{"$nulls":11},"",{"$nulls":11},"",{"$nulls":4},"",null,{"$f":"IF(BV438=\"\",\"\",AVERAGE($BV$10:BV438))","v":""},null,{"$f":"IF(BV438=\"\",\"\",_xlfn.NORM.DIST(BV438,AVERAGE($BV$10:$BV$5000),Dashboard!$L$36,FALSE))","v":""},{"$nulls":5},{"$f":"IF(BV438=\"\",\"\",_xlfn.NORM.DIST(BV438,AVERAGE(BV438:BW5428),Dashboard!$L$36,FALSE))","v":""}]
[{"$nulls":49},"",{"$nulls":11},"",{"$nulls":11},"",{"$nulls":4},"",null,{"$f":"IF(BV439=\"\",\"\",AVERAGE($BV$10:BV439))","v":""},null,{"$f":"IF(BV439=\"\",\"\",_xlfn.NORM.DIST(BV439,AVERAGE($BV$10:$BV$5000),Dashboard!$L$36,FALSE))","v":""},{"$nulls":5},{"$f":"IF(BV439=\"\",\"\",_xlfn.NORM.DIST(BV439,AVERAGE(BV439:BW5429),Dashboard!$L$36,FALSE))","v":""}]
[{"$nulls":49},"",{"$nulls":11},"",{"$nulls":11},"",{"$nulls":4},"",null,{"$f":"IF(BV440=\"\",\"\",AVERAGE($BV$10:BV440))","v":""},null,{"$f":"IF(BV440=\"\",\"\",_xlfn.NORM.DIST(BV440,AVERAGE($BV$10:$BV$5000),Dashboard!$L$36,FALSE))","v":""},{"$nulls":5},{"$f":"IF(BV440=\"\",\"\",_xlfn.NORM.DIST(BV440,AVERAGE(BV440:BW5430),Dashboard!$L$36,FALSE))","v":""}]
[{"$nulls":49},"",{"$nulls":11},"",{"$nulls":11},"",{"$nulls":4},"",null,{"$f":"IF(BV441=\"\",\"\",AVERAGE($BV$10:BV441))","v":""},null,{"$f":"IF(BV441=\"\",\"\",_xlfn.NORM.DIST(BV441,AVERAGE($BV$10:$BV$5000),Dashboard!$L$36,FALSE))","v":""},{"$nulls":5},{"$f":"IF(BV441=\"\",\"\",_xlfn.NORM.DIST(BV441,AVERAGE(BV441:BW5431),Dashboard!$L$36,FALSE))","v":""}]
[{"$nulls":49},"",{"$nulls":11},"",{"$nulls":11},"",{"$nulls":4},"",null,{"$f":"IF(BV442=\"\",\"\",AVERAGE($BV$10:BV442))","v":""},null,{"$f":"IF(BV442=\"\",\"\",_xlfn.NORM.DIST(BV442,AVERAGE($BV$10:$BV$5000),Dashboard!$L$36,FALSE))","v":""},{"$nulls":5},{"$f":"IF(BV442=\"\",\"\",_xlfn.NORM.DIST(BV442,AVERAGE(BV442:BW5432),Dashboard!$L$36,FALSE))","v":""}]
[{"$nulls":49},"",{"$nulls":11},"",{"$nulls":11},"",{"$nulls":4},"",null,{"$f":"IF(BV443=\"\",\"\",AVERAGE($BV$10:BV443))","v":""},null,{"$f":"IF(BV443=\"\",\"\",_xlfn.NORM.DIST(BV443,AVERAGE($BV$10:$BV$5000),Dashboard!$L$36,FALSE))","v":""},{"$nulls":5},{"$f":"IF(BV443=\"\",\"\",_xlfn.NORM.DIST(BV443,AVERAGE(BV443:BW5433),Dashboard!$L$36,FALSE))","v":""}]
[{"$nulls":49},"",{"$nulls":11},"",{"$nulls":11},"",{"$nulls":4},"",null,{"$f":"IF(BV444=\"\",\"\",AVERAGE($BV$10:BV444))","v":""},null,{"$f":"IF(BV444=\"\",\"\",_xlfn.NORM.DIST(BV444,AVERAGE($BV$10:$BV$5000),Dashboard!$L$36,FALSE))","v":""},{"$nulls":5},{"$f":"IF(BV444=\"\",\"\",_xlfn.NORM.DIST(BV444,AVERAGE(BV444:BW5434),Dashboard!$L$36,FALSE))","v":""}]
[{"$nulls":49},"",{"$nulls":11},"",{"$nulls":11},"",{"$nulls":4},"",null,{"$f":"IF(BV445=\"\",\"\",AVERAGE($BV$10:BV445))","v":""},null,{"$f":"IF(BV445=\"\",\"\",_xlfn.NORM.DIST(BV445,AVERAGE($BV$10:$BV$5000),Dashboard!$L$36,FALSE))","v":""},{"$nulls":5},{"$f":"IF(BV445=\"\",\"\",_xlfn.NORM.DIST(BV445,AVERAGE(BV445:BW5435),Dashboard!$L$36,FALSE))","v":""}]
[{"$nulls":49},"",{"$nulls":11},"",{"$nulls":11},"",{"$nulls":4},"",null,{"$f":"IF(BV446=\"\",\"\",AVERAGE($BV$10:BV446))","v":""},null,{"$f":"IF(BV446=\"\",\"\",_xlfn.NORM.DIST(BV446,AVERAGE($BV$10:$BV$5000),Dashboard!$L$36,FALSE))","v":""},{"$nulls":5},{"$f":"IF(BV446=\"\",\"\",_xlfn.NORM.DIST(BV446,AVERAGE(BV446:BW5436),Dashboard!$L$36,FALSE))","v":""}]
[{"$nulls":49},"",{"$nulls":11},"",{"$nulls":11},"",{"$nulls":4},"",null,{"$f":"IF(BV447=\"\",\"\",AVERAGE($BV$10:BV447))","v":""},null,{"$f":"IF(BV447=\"\",\"\",_xlfn.NORM.DIST(BV447,AVERAGE($BV$10:$BV$5000),Dashboard!$L$36,FALSE))","v":""},{"$nulls":5},{"$f":"IF(BV447=\"\",\"\",_xlfn.NORM.DIST(BV447,AVERAGE(BV447:BW5437),Dashboard!$L$36,FALSE))","v":""}]
[{"$nulls":49},"",{"$nulls":11},"",{"$nulls":11},"",{"$nulls":4},"",null,{"$f":"IF(BV448=\"\",\"\",AVERAGE($BV$10:BV448))","v":""},null,{"$f":"IF(BV448=\"\",\"\",_xlfn.NORM.DIST(BV448,AVERAGE($BV$10:$BV$5000),Dashboard!$L$36,FALSE))","v":""},{"$nulls":5},{"$f":"IF(BV448=\"\",\"\",_xlfn.NORM.DIST(BV448,AVERAGE(BV448:BW5438),Dashboard!$L$36,FALSE))","v":""}]
[{"$nulls":49},"",{"$nulls":11},"",{"$nulls":11},"",{"$nulls":4},"",null,{"$f":"IF(BV449=\"\",\"\",AVERAGE($BV$10:BV449))","v":""},null,{"$f":"IF(BV449=\"\",\"\",_xlfn.NORM.DIST(BV449,AVERAGE($BV$10:$BV$5000),Dashboard!$L$36,FALSE))","v":""},{"$nulls":5},{"$f":"IF(BV449=\"\",\"\",_xlfn.NORM.DIST(BV449,AVERAGE(BV449:BW5439),Dashboard!$L$36,FALSE))","v":""}]
[{"$nulls":49},"",{"$nulls":11},"",{"$nulls":11},"",{"$nulls":4},"",null,{"$f":"IF(BV450=\"\",\"\",AVERAGE($BV$10:BV450))","v":""},null,{"$f":"IF(BV450=\"\",\"\",_xlfn.NORM.DIST(BV450,AVERAGE($BV$10:$BV$5000),Dashboard!$L$36,FALSE))","v":""},{"$nulls":5},{"$f":"IF(BV450=\"\",\"\",_xlfn.NORM.DIST(BV450,AVERAGE(BV450:BW5440),Dashboard!$L$36,FALSE))","v":""}]
[{"$nulls":49},"",{"$nulls":11},"",{"$nulls":11},"",{"$nulls":4},"",null,{"$f":"IF(BV451=\"\",\"\",AVERAGE($BV$10:BV451))","v":""},null,{"$f":"IF(BV451=\"\",\"\",_xlfn.NORM.DIST(BV451,AVERAGE($BV$10:$BV$5000),Dashboard!$L$36,FALSE))","v":""},{"$nulls":5},{"$f":"IF(BV451=\"\",\"\",_xlfn.NORM.DIST(BV451,AVERAGE(BV451:BW5441),Dashboard!$L$36,FALSE))","v":""}]
[{"$nulls":49},"",{"$nulls":11},"",{"$nulls":11},"",{"$nulls":4},"",null,{"$f":"IF(BV452=\"\",\"\",AVERAGE($BV$10:BV452))","v":""},null,{"$f":"IF(BV452=\"\",\"\",_xlfn.NORM.DIST(BV452,AVERAGE($BV$10:$BV$5000),Dashboard!$L$36,FALSE))","v":""},{"$nulls":5},{"$f":"IF(BV452=\"\",\"\",_xlfn.NORM.DIST(BV452,AVERAGE(BV452:BW5442),Dashboard!$L$36,FALSE))","v":""}]
[{"$nulls":49},"",{"$nulls":11},"",{"$nulls":11},"",{"$nulls":4},"",null,{"$f":"IF(BV453=\"\",\"\",AVERAGE($BV$10:BV453))","v":""},null,{"$f":"IF(BV453=\"\",\"\",_xlfn.NORM.DIST(BV453,AVERAGE($BV$10:$BV$5000),Dashboard!$L$36,FALSE))","v":""},{"$nulls":5},{"$f":"IF(BV453=\"\",\"\",_xlfn.NORM.DIST(BV453,AVERAGE(BV453:BW5443),Dashboard!$L$36,FALSE))","v":""}]
[{"$nulls":49},"",{"$nulls":11},"",{"$nulls":11},"",{"$nulls":4},"",null,{"$f":"IF(BV454=\"\",\"\",AVERAGE($BV$10:BV454))","v":""},null,{"$f":"IF(BV454=\"\",\"\",_xlfn.NORM.DIST(BV454,AVERAGE($BV$10:$BV$5000),Dashboard!$L$36,FALSE))","v":""},{"$nulls":5},{"$f":"IF(BV454=\"\",\"\",_xlfn.NORM.DIST(BV454,AVERAGE(BV454:BW5444),Dashboard!$L$36,FALSE))","v":""}]
[{"$nulls":49},"",{"$nulls":11},"",{"$nulls":11},"",{"$nulls":4},"",null,{"$f":"IF(BV455=\"\",\"\",AVERAGE($BV$10:BV455))","v":""},null,{"$f":"IF(BV455=\"\",\"\",_xlfn.NORM.DIST(BV455,AVERAGE($BV$10:$BV$5000),Dashboard!$L$36,FALSE))","v":""},{"$nulls":5},{"$f":"IF(BV455=\"\",\"\",_xlfn.NORM.DIST(BV455,AVERAGE(BV455:BW5445),Dashboard!$L$36,FALSE))","v":""}]
[{"$nulls":49},"",{"$nulls":11},"",{"$nulls":11},"",{"$nulls":4},"",null,{"$f":"IF(BV456=\"\",\"\",AVERAGE($BV$10:BV456))","v":""},null,{"$f":"IF(BV456=\"\",\"\",_xlfn.NORM.DIST(BV456,AVERAGE($BV$10:$BV$5000),Dashboard!$L$36,FALSE))","v":""},{"$nulls":5},{"$f":"IF(BV456=\"\",\"\",_xlfn.NORM.DIST(BV456,AVERAGE(BV456:BW5446),Dashboard!$L$36,FALSE))","v":""}]
[{"$nulls":49},"",{"$nulls":11},"",{"$nulls":11},"",{"$nulls":4},"",null,{"$f":"IF(BV457=\"\",\"\",AVERAGE($BV$10:BV457))","v":""},null,{"$f":"IF(BV457=\"\",\"\",_xlfn.NORM.DIST(BV457,AVERAGE($BV$10:$BV$5000),Dashboard!$L$36,FALSE))","v":""},{"$nulls":5},{"$f":"IF(BV457=\"\",\"\",_xlfn.NORM.DIST(BV457,AVERAGE(BV457:BW5447),Dashboard!$L$36,FALSE))","v":""}]
[{"$nulls":49},"",{"$nulls":11},"",{"$nulls":11},"",{"$nulls":4},"",null,{"$f":"IF(BV458=\"\",\"\",AVERAGE($BV$10:BV458))","v":""},null,{"$f":"IF(BV458=\"\",\"\",_xlfn.NORM.DIST(BV458,AVERAGE($BV$10:$BV$5000),Dashboard!$L$36,FALSE))","v":""},{"$nulls":5},{"$f":"IF(BV458=\"\",\"\",_xlfn.NORM.DIST(BV458,AVERAGE(BV458:BW5448),Dashboard!$L$36,FALSE))","v":""}]
[{"$nulls":49},"",{"$nulls":11},"",{"$nulls":11},"",{"$nulls":4},"",null,{"$f":"IF(BV459=\"\",\"\",AVERAGE($BV$10:BV459))","v":""},null,{"$f":"IF(BV459=\"\",\"\",_xlfn.NORM.DIST(BV459,AVERAGE($BV$10:$BV$5000),Dashboard!$L$36,FALSE))","v":""},{"$nulls":5},{"$f":"IF(BV459=\"\",\"\",_xlfn.NORM.DIST(BV459,AVERAGE(BV459:BW5449),Dashboard!$L$36,FALSE))","v":""}]
[{"$nulls":49},"",{"$nulls":11},"",{"$nulls":11},"",{"$nulls":4},"",null,{"$f":"IF(BV460=\"\",\"\",AVERAGE($BV$10:BV460))","v":""},null,{"$f":"IF(BV460=\"\",\"\",_xlfn.NORM.DIST(BV460,AVERAGE($BV$10:$BV$5000),Dashboard!$L$36,FALSE))","v":""},{"$nulls":5},{"$f":"IF(BV460=\"\",\"\",_xlfn.NORM.DIST(BV460,AVERAGE(BV460:BW5450),Dashboard!$L$36,FALSE))","v":""}]
[{"$nulls":49},"",{"$nulls":11},"",{"$nulls":11},"",{"$nulls":4},"",null,{"$f":"IF(BV461=\"\",\"\",AVERAGE($BV$10:BV461))","v":""},null,{"$f":"IF(BV461=\"\",\"\",_xlfn.NORM.DIST(BV461,AVERAGE($BV$10:$BV$5000),Dashboard!$L$36,FALSE))","v":""},{"$nulls":5},{"$f":"IF(BV461=\"\",\"\",_xlfn.NORM.DIST(BV461,AVERAGE(BV461:BW5451),Dashboard!$L$36,FALSE))","v":""}]
[{"$nulls":49},"",{"$nulls":11},"",{"$nulls":11},"",{"$nulls":4},"",null,{"$f":"IF(BV462=\"\",\"\",AVERAGE($BV$10:BV462))","v":""},null,{"$f":"IF(BV462=\"\",\"\",_xlfn.NORM.DIST(BV462,AVERAGE($BV$10:$BV$5000),Dashboard!$L$36,FALSE))","v":""},{"$nulls":5},{"$f":"IF(BV462=\"\",\"\",_xlfn.NORM.DIST(BV462,AVERAGE(BV462:BW5452),Dashboard!$L$36,FALSE))","v":""}]
[{"$nulls":49},"",{"$nulls":11},"",{"$nulls":11},"",{"$nulls":4},"",null,{"$f":"IF(BV463=\"\",\"\",AVERAGE($BV$10:BV463))","v":""},null,{"$f":"IF(BV463=\"\",\"\",_xlfn.NORM.DIST(BV463,AVERAGE($BV$10:$BV$5000),Dashboard!$L$36,FALSE))","v":""},{"$nulls":5},{"$f":"IF(BV463=\"\",\"\",_xlfn.NORM.DIST(BV463,AVERAGE(BV463:BW5453),Dashboard!$L$36,FALSE))","v":""}]
[{"$nulls":49},"",{"$nulls":11},"",{"$nulls":11},"",{"$nulls":4},"",null,{"$f":"IF(BV464=\"\",\"\",AVERAGE($BV$10:BV464))","v":""},null,{"$f":"IF(BV464=\"\",\"\",_xlfn.NORM.DIST(BV464,AVERAGE($BV$10:$BV$5000),Dashboard!$L$36,FALSE))","v":""},{"$nulls":5},{"$f":"IF(BV464=\"\",\"\",_xlfn.NORM.DIST(BV464,AVERAGE(BV464:BW5454),Dashboard!$L$36,FALSE))","v":""}]
[{"$nulls":49},"",{"$nulls":11},"",{"$nulls":11},"",{"$nulls":4},"",null,{"$f":"IF(BV465=\"\",\"\",AVERAGE($BV$10:BV465))","v":""},null,{"$f":"IF(BV465=\"\",\"\",_xlfn.NORM.DIST(BV465,AVERAGE($BV$10:$BV$5000),Dashboard!$L$36,FALSE))","v":""},{"$nulls":5},{"$f":"IF(BV465=\"\",\"\",_xlfn.NORM.DIST(BV465,AVERAGE(BV465:BW5455),Dashboard!$L$36,FALSE))","v":""}]
[{"$nulls":49},"",{"$nulls":11},"",{"$nulls":11},"",{"$nulls":4},"",null,{"$f":"IF(BV466=\"\",\"\",AVERAGE($BV$10:BV466))","v":""},null,{"$f":"IF(BV466=\"\",\"\",_xlfn.NORM.DIST(BV466,AVERAGE($BV$10:$BV$5000),Dashboard!$L$36,FALSE))","v":""},{"$nulls":5},{"$f":"IF(BV466=\"\",\"\",_xlfn.NORM.DIST(BV466,AVERAGE(BV466:BW5456),Dashboard!$L$36,FALSE))","v":""}]
[{"$nulls":49},"",{"$nulls":11},"",{"$nulls":11},"",{"$nulls":4},"",null,{"$f":"IF(BV467=\"\",\"\",AVERAGE($BV$10:BV467))","v":""},null,{"$f":"IF(BV467=\"\",\"\",_xlfn.NORM.DIST(BV467,AVERAGE($BV$10:$BV$5000),Dashboard!$L$36,FALSE))","v":""},{"$nulls":5},{"$f":"IF(BV467=\"\",\"\",_xlfn.NORM.DIST(BV467,AVERAGE(BV467:BW5457),Dashboard!$L$36,FALSE))","v":""}]
[{"$nulls":49},"",{"$nulls":11},"",{"$nulls":11},"",{"$nulls":4},"",null,{"$f":"IF(BV468=\"\",\"\",AVERAGE($BV$10:BV468))","v":""},null,{"$f":"IF(BV468=\"\",\"\",_xlfn.NORM.DIST(BV468,AVERAGE($BV$10:$BV$5000),Dashboard!$L$36,FALSE))","v":""},{"$nulls":5},{"$f":"IF(BV468=\"\",\"\",_xlfn.NORM.DIST(BV468,AVERAGE(BV468:BW5458),Dashboard!$L$36,FALSE))","v":""}]
[{"$nulls":49},{"$f":"IF(SUM(AR469:AW469)=0,\"\",AVERAGE(AR469:AW469))","v":""},{"$nulls":11},{"$f":"IF(SUM(BD469:BI469)=0,\"\",AVERAGE(BD469:BI469))","v":""},{"$nulls":11},{"$f":"IF(SUM(BP469:BU469)=0,\"\",AVERAGE(BP469:BU469))","v":""},{"$nulls":4},{"$f":"IF(BV469=\"\",\"\",BV469-AJ469)","v":""},null,{"$f":"IF(BV469=\"\",\"\",AVERAGE($BV$10:BV469))","v":""},null,{"$f":"IF(BV469=\"\",\"\",_xlfn.NORM.DIST(BV469,AVERAGE($BV$10:$BV$5000),Dashboard!$L$36,FALSE))","v":""},{"$nulls":5},{"$f":"IF(BV469=\"\",\"\",_xlfn.NORM.DIST(BV469,AVERAGE(BV469:BW5459),Dashboard!$L$36,FALSE))","v":""}]
[{"$nulls":49},"",{"$nulls":11},"",{"$nulls":11},"",{"$nulls":4},"",null,{"$f":"IF(BV470=\"\",\"\",AVERAGE($BV$10:BV470))","v":""},null,{"$f":"IF(BV470=\"\",\"\",_xlfn.NORM.DIST(BV470,AVERAGE($BV$10:$BV$5000),Dashboard!$L$36,FALSE))","v":""},{"$nulls":5},{"$f":"IF(BV470=\"\",\"\",_xlfn.NORM.DIST(BV470,AVERAGE(BV470:BW5460),Dashboard!$L$36,FALSE))","v":""}]
[{"$nulls":49},"",{"$nulls":11},"",{"$nulls":11},"",{"$nulls":4},"",null,{"$f":"IF(BV471=\"\",\"\",AVERAGE($BV$10:BV471))","v":""},null,{"$f":"IF(BV471=\"\",\"\",_xlfn.NORM.DIST(BV471,AVERAGE($BV$10:$BV$5000),Dashboard!$L$36,FALSE))","v":""},{"$nulls":5},{"$f":"IF(BV471=\"\",\"\",_xlfn.NORM.DIST(BV471,AVERAGE(BV471:BW5461),Dashboard!$L$36,FALSE))","v":""}]
[{"$nulls":49},"",{"$nulls":11},"",{"$nulls":11},"",{"$nulls":4},"",null,{"$f":"IF(BV472=\"\",\"\",AVERAGE($BV$10:BV472))","v":""},null,{"$f":"IF(BV472=\"\",\"\",_xlfn.NORM.DIST(BV472,AVERAGE($BV$10:$BV$5000),Dashboard!$L$36,FALSE))","v":""},{"$nulls":5},{"$f":"IF(BV472=\"\",\"\",_xlfn.NORM.DIST(BV472,AVERAGE(BV472:BW5462),Dashboard!$L$36,FALSE))","v":""}]
[{"$nulls":49},"",{"$nulls":11},"",{"$nulls":11},"",{"$nulls":4},"",null,{"$f":"IF(BV473=\"\",\"\",AVERAGE($BV$10:BV473))","v":""},null,{"$f":"IF(BV473=\"\",\"\",_xlfn.NORM.DIST(BV473,AVERAGE($BV$10:$BV$5000),Dashboard!$L$36,FALSE))","v":""},{"$nulls":5},{"$f":"IF(BV473=\"\",\"\",_xlfn.NORM.DIST(BV473,AVERAGE(BV473:BW5463),Dashboard!$L$36,FALSE))","v":""}]
[{"$nulls":49},"",{"$nulls":11},"",{"$nulls":11},"",{"$nulls":4},"",null,{"$f":"IF(BV474=\"\",\"\",AVERAGE($BV$10:BV474))","v":""},null,{"$f":"IF(BV474=\"\",\"\",_xlfn.NORM.DIST(BV474,AVERAGE($BV$10:$BV$5000),Dashboard!$L$36,FALSE))","v":""},{"$nulls":5},{"$f":"IF(BV474=\"\",\"\",_xlfn.NORM.DIST(BV474,AVERAGE(BV474:BW5464),Dashboard!$L$36,FALSE))","v":""}]
[{"$nulls":49},"",{"$nulls":11},"",{"$nulls":11},"",{"$nulls":4},"",null,{"$f":"IF(BV475=\"\",\"\",AVERAGE($BV$10:BV475))","v":""},null,{"$f":"IF(BV475=\"\",\"\",_xlfn.NORM.DIST(BV475,AVERAGE($BV$10:$BV$5000),Dashboard!$L$36,FALSE))","v":""},{"$nulls":5},{"$f":"IF(BV475=\"\",\"\",_xlfn.NORM.DIST(BV475,AVERAGE(BV475:BW5465),Dashboard!$L$36,FALSE))","v":""}]
[{"$nulls":49},"",{"$nulls":11},"",{"$nulls":11},"",{"$nulls":4},"",null,{"$f":"IF(BV476=\"\",\"\",AVERAGE($BV$10:BV476))","v":""},null,{"$f":"IF(BV476=\"\",\"\",_xlfn.NORM.DIST(BV476,AVERAGE($BV$10:$BV$5000),Dashboard!$L$36,FALSE))","v":""},{"$nulls":5},{"$f":"IF(BV476=\"\",\"\",_xlfn.NORM.DIST(BV476,AVERAGE(BV476:BW5466),Dashboard!$L$36,FALSE))","v":""}]
[{"$nulls":49},"",{"$nulls":11},"",{"$nulls":11},"",{"$nulls":4},"",null,{"$f":"IF(BV477=\"\",\"\",AVERAGE($BV$10:BV477))","v":""},null,{"$f":"IF(BV477=\"\",\"\",_xlfn.NORM.DIST(BV477,AVERAGE($BV$10:$BV$5000),Dashboard!$L$36,FALSE))","v":""},{"$nulls":5},{"$f":"IF(BV477=\"\",\"\",_xlfn.NORM.DIST(BV477,AVERAGE(BV477:BW5467),Dashboard!$L$36,FALSE))","v":""}]
[{"$nulls":49},"",{"$nulls":11},"",{"$nulls":11},"",{"$nulls":4},"",null,{"$f":"IF(BV478=\"\",\"\",AVERAGE($BV$10:BV478))","v":""},null,{"$f":"IF(BV478=\"\",\"\",_xlfn.NORM.DIST(BV478,AVERAGE($BV$10:$BV$5000),Dashboard!$L$36,FALSE))","v":""},{"$nulls":5},{"$f":"IF(BV478=\"\",\"\",_xlfn.NORM.DIST(BV478,AVERAGE(BV478:BW5468),Dashboard!$L$36,FALSE))","v":""}]
[{"$nulls":49},"",{"$nulls":11},"",{"$nulls":11},"",{"$nulls":4},"",null,{"$f":"IF(BV479=\"\",\"\",AVERAGE($BV$10:BV479))","v":""},null,{"$f":"IF(BV479=\"\",\"\",_xlfn.NORM.DIST(BV479,AVERAGE($BV$10:$BV$5000),Dashboard!$L$36,FALSE))","v":""},{"$nulls":5},{"$f":"IF(BV479=\"\",\"\",_xlfn.NORM.DIST(BV479,AVERAGE(BV479:BW5469),Dashboard!$L$36,FALSE))","v":""}]
[{"$nulls":49},"",{"$nulls":11},"",{"$nulls":11},"",{"$nulls":4},"",null,{"$f":"IF(BV480=\"\",\"\",AVERAGE($BV$10:BV480))","v":""},null,{"$f":"IF(BV480=\"\",\"\",_xlfn.NORM.DIST(BV480,AVERAGE($BV$10:$BV$5000),Dashboard!$L$36,FALSE))","v":""},{"$nulls":5},{"$f":"IF(BV480=\"\",\"\",_xlfn.NORM.DIST(BV480,AVERAGE(BV480:BW5470),Dashboard!$L$36,FALSE))","v":""}]
[{"$nulls":49},"",{"$nulls":11},"",{"$nulls":11},"",{"$nulls":4},"",null,{"$f":"IF(BV481=\"\",\"\",AVERAGE($BV$10:BV481))","v":""},null,{"$f":"IF(BV481=\"\",\"\",_xlfn.NORM.DIST(BV481,AVERAGE($BV$10:$BV$5000),Dashboard!$L$36,FALSE))","v":""},{"$nulls":5},{"$f":"IF(BV481=\"\",\"\",_xlfn.NORM.DIST(BV481,AVERAGE(BV481:BW5471),Dashboard!$L$36,FALSE))","v":""}]
[{"$nulls":49},"",{"$nulls":11},"",{"$nulls":11},"",{"$nulls":4},"",null,{"$f":"IF(BV482=\"\",\"\",AVERAGE($BV$10:BV482))","v":""},null,{"$f":"IF(BV482=\"\",\"\",_xlfn.NORM.DIST(BV482,AVERAGE($BV$10:$BV$5000),Dashboard!$L$36,FALSE))","v":""},{"$nulls":5},{"$f":"IF(BV482=\"\",\"\",_xlfn.NORM.DIST(BV482,AVERAGE(BV482:BW5472),Dashboard!$L$36,FALSE))","v":""}]
[{"$nulls":49},"",{"$nulls":11},"",{"$nulls":11},"",{"$nulls":4},"",null,{"$f":"IF(BV483=\"\",\"\",AVERAGE($BV$10:BV483))","v":""},null,{"$f":"IF(BV483=\"\",\"\",_xlfn.NORM.DIST(BV483,AVERAGE($BV$10:$BV$5000),Dashboard!$L$36,FALSE))","v":""},{"$nulls":5},{"$f":"IF(BV483=\"\",\"\",_xlfn.NORM.DIST(BV483,AVERAGE(BV483:BW5473),Dashboard!$L$36,FALSE))","v":""}]
[{"$nulls":49},"",{"$nulls":11},"",{"$nulls":11},"",{"$nulls":4},"",null,{"$f":"IF(BV484=\"\",\"\",AVERAGE($BV$10:BV484))","v":""},null,{"$f":"IF(BV484=\"\",\"\",_xlfn.NORM.DIST(BV484,AVERAGE($BV$10:$BV$5000),Dashboard!$L$36,FALSE))","v":""},{"$nulls":5},{"$f":"IF(BV484=\"\",\"\",_xlfn.NORM.DIST(BV484,AVERAGE(BV484:BW5474),Dashboard!$L$36,FALSE))","v":""}]
[{"$nulls":49},"",{"$nulls":11},"",{"$nulls":11},"",{"$nulls":4},"",null,{"$f":"IF(BV485=\"\",\"\",AVERAGE($BV$10:BV485))","v":""},null,{"$f":"IF(BV485=\"\",\"\",_xlfn.NORM.DIST(BV485,AVERAGE($BV$10:$BV$5000),Dashboard!$L$36,FALSE))","v":""},{"$nulls":5},{"$f":"IF(BV485=\"\",\"\",_xlfn.NORM.DIST(BV485,AVERAGE(BV485:BW5475),Dashboard!$L$36,FALSE))","v":""}]
[{"$nulls":49},"",{"$nulls":11},"",{"$nulls":11},"",{"$nulls":4},"",null,{"$f":"IF(BV486=\"\",\"\",AVERAGE($BV$10:BV486))","v":""},null,{"$f":"IF(BV486=\"\",\"\",_xlfn.NORM.DIST(BV486,AVERAGE($BV$10:$BV$5000),Dashboard!$L$36,FALSE))","v":""},{"$nulls":5},{"$f":"IF(BV486=\"\",\"\",_xlfn.NORM.DIST(BV486,AVERAGE(BV486:BW5476),Dashboard!$L$36,FALSE))","v":""}]
[{"$nulls":49},"",{"$nulls":11},"",{"$nulls":11},"",{"$nulls":4},"",null,{"$f":"IF(BV487=\"\",\"\",AVERAGE($BV$10:BV487))","v":""},null,{"$f":"IF(BV487=\"\",\"\",_xlfn.NORM.DIST(BV487,AVERAGE($BV$10:$BV$5000),Dashboard!$L$36,FALSE))","v":""},{"$nulls":5},{"$f":"IF(BV487=\"\",\"\",_xlfn.NORM.DIST(BV487,AVERAGE(BV487:BW5477),Dashboard!$L$36,FALSE))","v":""}]
[{"$nulls":49},"",{"$nulls":11},"",{"$nulls":11},"",{"$nulls":4},"",null,{"$f":"IF(BV488=\"\",\"\",AVERAGE($BV$10:BV488))","v":""},null,{"$f":"IF(BV488=\"\",\"\",_xlfn.NORM.DIST(BV488,AVERAGE($BV$10:$BV$5000),Dashboard!$L$36,FALSE))","v":""},{"$nulls":5},{"$f":"IF(BV488=\"\",\"\",_xlfn.NORM.DIST(BV488,AVERAGE(BV488:BW5478),Dashboard!$L$36,FALSE))","v":""}]
[{"$nulls":49},"",{"$nulls":11},"",{"$nulls":11},"",{"$nulls":4},"",null,{"$f":"IF(BV489=\"\",\"\",AVERAGE($BV$10:BV489))","v":""},null,{"$f":"IF(BV489=\"\",\"\",_xlfn.NORM.DIST(BV489,AVERAGE($BV$10:$BV$5000),Dashboard!$L$36,FALSE))","v":""},{"$nulls":5},{"$f":"IF(BV489=\"\",\"\",_xlfn.NORM.DIST(BV489,AVERAGE(BV489:BW5479),Dashboard!$L$36,FALSE))","v":""}]
[{"$nulls":49},"",{"$nulls":11},"",{"$nulls":11},"",{"$nulls":4},"",null,{"$f":"IF(BV490=\"\",\"\",AVERAGE($BV$10:BV490))","v":""},null,{"$f":"IF(BV490=\"\",\"\",_xlfn.NORM.DIST(BV490,AVERAGE($BV$10:$BV$5000),Dashboard!$L$36,FALSE))","v":""},{"$nulls":5},{"$f":"IF(BV490=\"\",\"\",_xlfn.NORM.DIST(BV490,AVERAGE(BV490:BW5480),Dashboard!$L$36,FALSE))","v":""}]
[{"$nulls":49},"",{"$nulls":11},"",{"$nulls":11},"",{"$nulls":4},"",null,{"$f":"IF(BV491=\"\",\"\",AVERAGE($BV$10:BV491))","v":""},null,{"$f":"IF(BV491=\"\",\"\",_xlfn.NORM.DIST(BV491,AVERAGE($BV$10:$BV$5000),Dashboard!$L$36,FALSE))","v":""},{"$nulls":5},{"$f":"IF(BV491=\"\",\"\",_xlfn.NORM.DIST(BV491,AVERAGE(BV491:BW5481),Dashboard!$L$36,FALSE))","v":""}]
[{"$nulls":49},"",{"$nulls":11},"",{"$nulls":11},"",{"$nulls":4},"",null,{"$f":"IF(BV492=\"\",\"\",AVERAGE($BV$10:BV492))","v":""},null,{"$f":"IF(BV492=\"\",\"\",_xlfn.NORM.DIST(BV492,AVERAGE($BV$10:$BV$5000),Dashboard!$L$36,FALSE))","v":""},{"$nulls":5},{"$f":"IF(BV492=\"\",\"\",_xlfn.NORM.DIST(BV492,AVERAGE(BV492:BW5482),Dashboard!$L$36,FALSE))","v":""}]
[{"$nulls":49},"",{"$nulls":11},"",{"$nulls":11},"",{"$nulls":4},"",null,{"$f":"IF(BV493=\"\",\"\",AVERAGE($BV$10:BV493))","v":""},null,{"$f":"IF(BV493=\"\",\"\",_xlfn.NORM.DIST(BV493,AVERAGE($BV$10:$BV$5000),Dashboard!$L$36,FALSE))","v":""},{"$nulls":5},{"$f":"IF(BV493=\"\",\"\",_xlfn.NORM.DIST(BV493,AVERAGE(BV493:BW5483),Dashboard!$L$36,FALSE))","v":""}]
[{"$nulls":49},"",{"$nulls":11},"",{"$nulls":11},"",{"$nulls":4},"",null,{"$f":"IF(BV494=\"\",\"\",AVERAGE($BV$10:BV494))","v":""},null,{"$f":"IF(BV494=\"\",\"\",_xlfn.NORM.DIST(BV494,AVERAGE($BV$10:$BV$5000),Dashboard!$L$36,FALSE))","v":""},{"$nulls":5},{"$f":"IF(BV494=\"\",\"\",_xlfn.NORM.DIST(BV494,AVERAGE(BV494:BW5484),Dashboard!$L$36,FALSE))","v":""}]
[{"$nulls":49},"",{"$nulls":11},"",{"$nulls":11},"",{"$nulls":4},"",null,{"$f":"IF(BV495=\"\",\"\",AVERAGE($BV$10:BV495))","v":""},null,{"$f":"IF(BV495=\"\",\"\",_xlfn.NORM.DIST(BV495,AVERAGE($BV$10:$BV$5000),Dashboard!$L$36,FALSE))","v":""},{"$nulls":5},{"$f":"IF(BV495=\"\",\"\",_xlfn.NORM.DIST(BV495,AVERAGE(BV495:BW5485),Dashboard!$L$36,FALSE))","v":""}]
[{"$nulls":49},"",{"$nulls":11},"",{"$nulls":11},"",{"$nulls":4},"",null,{"$f":"IF(BV496=\"\",\"\",AVERAGE($BV$10:BV496))","v":""},null,{"$f":"IF(BV496=\"\",\"\",_xlfn.NORM.DIST(BV496,AVERAGE($BV$10:$BV$5000),Dashboard!$L$36,FALSE))","v":""},{"$nulls":5},{"$f":"IF(BV496=\"\",\"\",_xlfn.NORM.DIST(BV496,AVERAGE(BV496:BW5486),Dashboard!$L$36,FALSE))","v":""}]
[{"$nulls":49},"",{"$nulls":11},"",{"$nulls":11},"",{"$nulls":4},"",null,{"$f":"IF(BV497=\"\",\"\",AVERAGE($BV$10:BV497))","v":""},null,{"$f":"IF(BV497=\"\",\"\",_xlfn.NORM.DIST(BV497,AVERAGE($BV$10:$BV$5000),Dashboard!$L$36,FALSE))","v":""},{"$nulls":5},{"$f":"IF(BV497=\"\",\"\",_xlfn.NORM.DIST(BV497,AVERAGE(BV497:BW5487),Dashboard!$L$36,FALSE))","v":""}]
[{"$nulls":49},"",{"$nulls":11},"",{"$nulls":11},"",{"$nulls":4},"",null,{"$f":"IF(BV498=\"\",\"\",AVERAGE($BV$10:BV498))","v":""},null,{"$f":"IF(BV498=\"\",\"\",_xlfn.NORM.DIST(BV498,AVERAGE($BV$10:$BV$5000),Dashboard!$L$36,FALSE))","v":""},{"$nulls":5},{"$f":"IF(BV498=\"\",\"\",_xlfn.NORM.DIST(BV498,AVERAGE(BV498:BW5488),Dashboard!$L$36,FALSE))","v":""}]
[{"$nulls":49},"",{"$nulls":11},"",{"$nulls":11},"",{"$nulls":4},"",null,{"$f":"IF(BV499=\"\",\"\",AVERAGE($BV$10:BV499))","v":""},null,{"$f":"IF(BV499=\"\",\"\",_xlfn.NORM.DIST(BV499,AVERAGE($BV$10:$BV$5000),Dashboard!$L$36,FALSE))","v":""},{"$nulls":5},{"$f":"IF(BV499=\"\",\"\",_xlfn.NORM.DIST(BV499,AVERAGE(BV499:BW5489),Dashboard!$L$36,FALSE))","v":""}]
[{"$nulls":49},"",{"$nulls":11},"",{"$nulls":11},"",{"$nulls":4},"",null,{"$f":"IF(BV500=\"\",\"\",AVERAGE($BV$10:BV500))","v":""},null,{"$f":"IF(BV500=\"\",\"\",_xlfn.NORM.DIST(BV500,AVERAGE($BV$10:$BV$5000),Dashboard!$L$36,FALSE))","v":""},{"$nulls":5},{"$f":"IF(BV500=\"\",\"\",_xlfn.NORM.DIST(BV500,AVERAGE(BV500:BW5490),Dashboard!$L$36,FALSE))","v":""}]

{"sheet":"Dashboard","index":2,"n_rows":36,"n_cols":29,"rows_kept":36,"merged":[[0,0,0,37],[1,0,1,5],[1,6,1,7],[1,20,1,25],[1,26,1,27],[2,0,2,5],[2,6,2,7],[2,20,2,25],[2,26,2,27],[3,20,3,25],[3,26,3,27],[10,0,10,7],[10,8,10,11],[10,20,10,27],[10,28,10,31],[11,0,11,7],[11,8,11,11],[11,20,11,27],[11,28,11,31],[23,0,23,1],[23,2,23,6],[23,9,23,10],[23,11,23,15],[35,0,35,1],[35,2,35,3],[35,4,35,5],[35,9,35,10],[35,11,35,12],[35,13,35,14],[35,18,35,19],[35,20,35,24]]}
[{"$f":"Register!AZ6","v":"[ref.number]"}]
["Total number of cubes",{"$nulls":5},{"$f":"SUM(Register!N10:O1048576)","v":90},{"$nulls":13},"Total number of cubes",{"$nulls":5},{"$f":"G2","v":90}]
["Concrete QTY m3",{"$nulls":5},{"$f":"SUM(Register!AL10:AM1048576)","v":198},{"$nulls":13},"Failed",{"$nulls":5},{"$f":"COUNTIF(Register!BX10:BZ1048576,U3)","v":0}]
[{"$nulls":20},"Passed",{"$nulls":5},{"$f":"COUNTIF(Register!BX10:BZ1048576,U4)","v":10}]
[]
[]
[]
[]
[]
[]
["Average no. cubes per m3",{"$nulls":7},{"$f":"G2/G3","v":{"v":0.45454545454545453,"d":"0.5"}},{"$nulls":11},"Percentage failed",{"$nulls":7},{"$f":"IFERROR(AA3/AA4,0)","v":{"v":0,"d":"0.00%"}}]
["As of",{"$nulls":7},{"$f":"MAXA(Register!AF10:AI1048576)","v":"2015-01-09"},{"$nulls":11},"As of",{"$nulls":7},{"$f":"IF(MAXA(Register!$BL$10:$BO$1048576)=0,TODAY(),MAXA(Register!$BL$10:$BO$1048576))","v":"2015-02-06"}]
{"$rows_empty":11}
["Failed",null,{"$f":"AA3","v":0},{"$nulls":6},{"$f":"U12","v":"As of"},null,{"$f":"AC12","v":"2015-02-06"}]
{"$rows_empty":11}
["x̄",null,{"$f":"IFERROR(AVERAGE(Register!BV10:BW1048576),0)","v":{"v":39.99999999999999,"d":"40.00"}},null,"MPa",{"$nulls":4},"σ",null,{"$f":"IFERROR(_xlfn.STDEV.P(Register!CA10:CB500),0)","v":{"v":0.7549834435270742,"d":"0.75"}},null,"MPa",{"$nulls":4},{"$f":"U12","v":"As of"},null,{"$f":"AC12","v":"2015-02-06"}]

{"sheet":"Total QTYs","index":3,"n_rows":34,"n_cols":45,"rows_kept":34,"merged":[[0,0,0,4],[0,5,0,25],[0,26,1,51],[1,0,1,4],[1,5,1,25],[2,0,2,4],[2,5,2,25],[2,26,2,30],[2,31,2,38],[2,39,2,43],[2,44,2,51],[3,0,3,4],[3,5,3,25],[3,26,3,30],[3,31,3,38],[3,39,3,43],[3,44,3,51],[4,0,4,4],[4,5,4,25],[4,26,4,30],[4,31,4,51],[5,0,5,4],[5,5,5,25],[5,26,5,30],[5,31,5,51],[6,0,7,1],[6,2,6,11],[6,12,6,19],[6,20,7,23],[6,24,7,27],[6,28,7,31],[6,32,7,35],[6,36,7,39],[6,40,7,51],[7,2,7,6],[7,7,7,11],[7,12,7,15],[7,16,7,19],[8,0,8,1],[8,2,8,6],[8,7,8,11],[8,12,8,15],[8,16,8,19],[8,20,8,23],[8,24,8,27],[8,28,8,31],[8,32,8,35],[8,36,8,39],[8,40,8,51],[9,0,9,1],[9,2,9,6],[9,7,9,11],[9,12,9,15],[9,16,9,19],[9,20,9,23],[9,24,9,27],[9,28,9,31],[9,32,9,35],[9,36,9,39],[9,40,9,51],[10,0,10,1],[10,2,10,6],[10,7,10,11],[10,12,10,15],[10,16,10,19],[10,20,10,23],[10,24,10,27],[10,28,10,31],[10,32,10,35],[10,36,10,39],[10,40,10,51],[11,0,11,1],[11,2,11,6],[11,7,11,11],[11,12,11,15],[11,16,11,19],[11,20,11,23],[11,24,11,27],[11,28,11,31],[11,32,11,35],[11,36,11,39],[11,40,11,51],[12,0,12,1],[12,2,12,6],[12,7,12,11],[12,12,12,15],[12,16,12,19],[12,20,12,23],[12,24,12,27],[12,28,12,31],[12,32,12,35],[12,36,12,39],[12,40,12,51],[13,0,13,1],[13,2,13,6],[13,7,13,11],[13,12,13,15],[13,16,13,19],[13,20,13,23],[13,24,13,27],[13,28,13,31],[13,32,13,35],[13,36,13,39],[13,40,13,51],[14,0,14,1],[14,2,14,6],[14,7,14,11],[14,12,14,15],[14,16,14,19],[14,20,14,23],[14,24,14,27],[14,28,14,31],[14,32,14,35],[14,36,14,39],[14,40,14,51],[15,0,15,1],[15,2,15,6],[15,7,15,11],[15,12,15,15],[15,16,15,19],[15,20,15,23],[15,24,15,27],[15,28,15,31],[15,32,15,35],[15,36,15,39],[15,40,15,51],[16,0,16,1],[16,2,16,6],[16,7,16,11],[16,12,16,15],[16,16,16,19],[16,20,16,23],[16,24,16,27],[16,28,16,31],[16,32,16,35],[16,36,16,39],[16,40,16,51],[17,0,17,1],[17,2,17,6],[17,7,17,11],[17,12,17,15],[17,16,17,19],[17,20,17,23],[17,24,17,27],[17,28,17,31],[17,32,17,35],[17,36,17,39],[17,40,17,51],[18,0,18,1],[18,2,18,6],[18,7,18,11],[18,12,18,15],[18,16,18,19],[18,20,18,23],[18,24,18,27],[18,28,18,31],[18,32,18,35],[18,36,18,39],[18,40,18,51],[19,0,19,1],[19,2,19,6],[19,7,19,11],[19,12,19,15],[19,16,19,19],[19,20,19,23],[19,24,19,27],[19,28,19,31],[19,32,19,35],[19,36,19,39],[19,40,19,51],[20,0,20,1],[20,2,20,6],[20,7,20,11],[20,12,20,15],[20,16,20,19],[20,20,20,23],[20,24,20,27],[20,28,20,31],[20,32,20,35],[20,36,20,39],[20,40,20,51],[21,0,21,1],[21,2,21,6],[21,7,21,11],[21,12,21,15],[21,16,21,19],[21,20,21,23],[21,24,21,27],[21,28,21,31],[21,32,21,35],[21,36,21,39],[21,40,21,51],[22,0,22,1],[22,2,22,6],[22,7,22,11],[22,12,22,15],[22,16,22,19],[22,20,22,23],[22,24,22,27],[22,28,22,31],[22,32,22,35],[22,36,22,39],[22,40,22,51],[23,0,23,1],[23,2,23,6],[23,7,23,11],[23,12,23,15],[23,16,23,19],[23,20,23,23],[23,24,23,27],[23,28,23,31],[23,32,23,35],[23,36,23,39],[23,40,23,51],[24,0,24,1],[24,2,24,6],[24,7,24,11],[24,12,24,15],[24,16,24,19],[24,20,24,23],[24,24,24,27],[24,28,24,31],[24,32,24,35],[24,36,24,39],[24,40,24,51],[25,0,25,1],[25,2,25,6],[25,7,25,11],[25,12,25,15],[25,16,25,19],[25,20,25,23],[25,24,25,27],[25,28,25,31],[25,32,25,35],[25,36,25,39],[25,40,25,51],[26,0,26,1],[26,2,26,6],[26,7,26,11],[26,12,26,15],[26,16,26,19],[26,20,26,23],[26,24,26,27],[26,28,26,31],[26,32,26,35],[26,36,26,39],[26,40,26,51],[27,0,27,1],[27,2,27,6],[27,7,27,11],[27,12,27,15],[27,16,27,19],[27,20,27,23],[27,24,27,27],[27,28,27,31],[27,32,27,35],[27,36,27,39],[27,40,27,51],[28,0,28,1],[28,2,28,6],[28,7,28,11],[28,12,28,15],[28,16,28,19],[28,20,28,23],[28,24,28,27],[28,28,28,31],[28,32,28,35],[28,36,28,39],[28,40,28,51],[29,0,29,1],[29,2,29,6],[29,7,29,11],[29,12,29,15],[29,16,29,19],[29,20,29,23],[29,24,29,27],[29,28,29,31],[29,32,29,35],[29,36,29,39],[29,40,29,51],[30,0,30,1],[30,2,30,6],[30,7,30,11],[30,12,30,15],[30,16,30,19],[30,20,30,23],[30,24,30,27],[30,28,30,31],[30,32,30,35],[30,36,30,39],[30,40,30,51],[31,0,31,1],[31,2,31,6],[31,7,31,11],[31,12,31,15],[31,16,31,19],[31,20,31,23],[31,24,31,27],[31,28,31,31],[31,32,31,35],[31,36,31,39],[31,40,31,51],[32,0,32,1],[32,2,32,6],[32,7,32,11],[32,12,32,15],[32,16,32,19],[32,20,32,23],[32,24,32,27],[32,28,32,31],[32,32,32,35],[32,36,32,39],[32,40,32,51],[33,12,33,15],[33,16,33,19],[33,20,33,23],[33,24,33,27],[33,28,33,31],[33,32,33,35],[33,36,33,39]]}
["Project:",{"$nulls":4},{"$f":"IF(Register!H1=\"\",\"\",Register!H1)","v":"[Project Name]"},{"$nulls":20},"Total Concrete QTYs"]
["Sub-Project or Phase:",{"$nulls":4},{"$f":"IF(Register!H2=\"\",\"\",Register!H2)","v":"[Sub-Project or Phase]"}]
["Client:",{"$nulls":4},{"$f":"IF(Register!H3=\"\",\"\",Register!H3)","v":"[Client]"},{"$nulls":20},"Project Mngr.:",{"$nulls":4},{"$f":"IF(Register!AZ3=\"\",\"\",Register!AZ3)","v":"[Proj. Mngr.]"},{"$nulls":7},"Printed on",{"$nulls":4},{"$f":"TODAY()","v":"2015-03-11"}]
["Client's Repres.:",{"$nulls":4},{"$f":"IF(Register!H4=\"\",\"\",Register!H4)","v":"[Client's Representative]"},{"$nulls":20},"QA/QC Mngr.:",{"$nulls":4},{"$f":"IF(Register!AZ4=\"\",\"\",Register!AZ4)","v":"[QA/QC Mngr.]"}]
["Contractor:",{"$nulls":4},{"$f":"IF(Register!H5=\"\",\"\",Register!H5)","v":"[Contractor]"},{"$nulls":20},"Mix Design:",{"$nulls":4},{"$f":"Register!AZ5","v":"[Mix Design]"}]
[{"$nulls":5},{"$f":"IF(Register!H6=\"\",\"\",Register!H6)","v":""},{"$nulls":20},"Ref.-No.:",{"$nulls":4},"[ref. no.]"]
["SN",null,"Period",{"$nulls":9},"Consumption",{"$nulls":7},{"$f":"IF(Supplier!$A1=\"\",\"\",Supplier!$A1)","v":"Supplier A"},{"$nulls":3},{"$f":"IF(Supplier!$A2=\"\",\"\",Supplier!$A2)","v":"Supplier B"},{"$nulls":3},{"$f":"IF(Supplier!$A3=\"\",\"\",Supplier!$A3)","v":"Supplier C"},{"$nulls":3},{"$f":"IF(Supplier!$A4=\"\",\"\",Supplier!$A4)","v":"Supplier D"},{"$nulls":3},{"$f":"IF(Supplier!$A5=\"\",\"\",Supplier!$A5)","v":"Supplier E"},{"$nulls":3},"Remarks"]
[null,null,"Start",{"$nulls":4},"End",{"$nulls":4},"This Period",{"$nulls":3},"Cummulative"]
["A",null,"B",{"$nulls":4},"C",{"$nulls":4},"D",{"$nulls":3},"E",{"$nulls":3},"F",{"$nulls":3},"G",{"$nulls":3},"H",{"$nulls":3},"I",{"$nulls":3},"J",{"$nulls":3},"K"]
[{"v":1,"d":"0001"},null,"2015-01-01",{"$nulls":4},{"$f":"EDATE(C10,1)-1","v":"2015-01-31"},{"$nulls":4},{"$f":"SUMIFS(Register!$AL$10:$AL$1048576,Register!$AF$10:$AF$1048576,\">=\"&C10,Register!$AF$10:$AF$1048576,\"<=\"&H10)","v":{"v":198,"d":"198.0m3"}},{"$nulls":3},{"$f":"M10","v":{"v":198,"d":"198.0m3"}},{"$nulls":3},{"$f":"IF(SUMIFS(Register!$AL$10:$AL$1048576,Register!$AF$10:$AF$1048576,\">=\"&$C10,Register!$AF$10:$AF$1048576,\"<=\"&$H10,Register!$AB$10:$AB$1048576,\"=\"&$U$7)=0,\"\",SUMIFS(Register!$AL$10:$AL$1048576,Register!$AF$10:$AF$1048576,\">=\"&$C10,Register!$AF$10:$AF$1048576,\"<=\"&$H10,Register!$AB$10:$AB$1048576,\"=\"&$U$7))","v":{"v":38,"d":"38.0m3"}},{"$nulls":3},{"$f":"IF(SUMIFS(Register!$AL$10:$AL$1048576,Register!$AF$10:$AF$1048576,\">=\"&$C10,Register!$AF$10:$AF$1048576,\"<=\"&$H10,Register!$AB$10:$AB$1048576,\"=\"&$Y$7)=0,\"\",SUMIFS(Register!$AL$10:$AL$1048576,Register!$AF$10:$AF$1048576,\">=\"&$C10,Register!$AF$10:$AF$1048576,\"<=\"&$H10,Register!$AB$10:$AB$1048576,\"=\"&$Y$7))","v":{"v":38,"d":"38.0m3"}},{"$nulls":3},{"$f":"IF(SUMIFS(Register!$AL$10:$AL$1048576,Register!$AF$10:$AF$1048576,\">=\"&$C10,Register!$AF$10:$AF$1048576,\"<=\"&$H10,Register!$AB$10:$AB$1048576,\"=\"&$AC$7)=0,\"\",SUMIFS(Register!$AL$10:$AL$1048576,Register!$AF$10:$AF$1048576,\">=\"&$C10,Register!$AF$10:$AF$1048576,\"<=\"&$H10,Register!$AB$10:$AB$1048576,\"=\"&$AC$7))","v":{"v":38,"d":"38.0m3"}},{"$nulls":3},{"$f":"IF(SUMIFS(Register!$AL$10:$AL$1048576,Register!$AF$10:$AF$1048576,\">=\"&$C10,Register!$AF$10:$AF$1048576,\"<=\"&$H10,Register!$AB$10:$AB$1048576,\"=\"&$AG$7)=0,\"\",SUMIFS(Register!$AL$10:$AL$1048576,Register!$AF$10:$AF$1048576,\">=\"&$C10,Register!$AF$10:$AF$1048576,\"<=\"&$H10,Register!$AB$10:$AB$1048576,\"=\"&$AG$7))","v":{"v":38,"d":"38.0m3"}},{"$nulls":3},{"$f":"IF(SUMIFS(Register!$AL$10:$AL$1048576,Register!$AF$10:$AF$1048576,\">=\"&$C10,Register!$AF$10:$AF$1048576,\"<=\"&$H10,Register!$AB$10:$AB$1048576,\"=\"&$AK$7)=0,\"\",SUMIFS(Register!$AL$10:$AL$1048576,Register!$AF$10:$AF$1048576,\">=\"&$C10,Register!$AF$10:$AF$1048576,\"<=\"&$H10,Register!$AB$10:$AB$1048576,\"=\"&$AK$7))","v":{"v":46,"d":"46.0m3"}}]
[{"v":2,"d":"0002"},null,{"$f":"EDATE(C10,1)","v":"2015-02-01"},{"$nulls":4},{"$f":"EDATE(C11,1)-1","v":"2015-02-28"},{"$nulls":4},{"$f":"IF(SUMIFS(Register!$AL$10:$AL$1048576,Register!$AF$10:$AF$1048576,\">=\"&C11,Register!$AF$10:$AF$1048576,\"<=\"&H11)=0,\"\",SUMIFS(Register!$AL$10:$AL$1048576,Register!$AF$10:$AF$1048576,\">=\"&C11,Register!$AF$10:$AF$1048576,\"<=\"&H11))","v":""},{"$nulls":3},{"$f":"IF(M11=\"\",\"\",Q10+M11)","v":""},{"$nulls":3},{"$f":"IF(SUMIFS(Register!$AL$10:$AL$1048576,Register!$AF$10:$AF$1048576,\">=\"&$C11,Register!$AF$10:$AF$1048576,\"<=\"&$H11,Register!$AB$10:$AB$1048576,\"=\"&$U$7)=0,\"\",SUMIFS(Register!$AL$10:$AL$1048576,Register!$AF$10:$AF$1048576,\">=\"&$C11,Register!$AF$10:$AF$1048576,\"<=\"&$H11,Register!$AB$10:$AB$1048576,\"=\"&$U$7))","v":""},{"$nulls":3},{"$f":"IF(SUMIFS(Register!$AL$10:$AL$1048576,Register!$AF$10:$AF$1048576,\">=\"&$C11,Register!$AF$10:$AF$1048576,\"<=\"&$H11,Register!$AB$10:$AB$1048576,\"=\"&$Y$7)=0,\"\",SUMIFS(Register!$AL$10:$AL$1048576,Register!$AF$10:$AF$1048576,\">=\"&$C11,Register!$AF$10:$AF$1048576,\"<=\"&$H11,Register!$AB$10:$AB$1048576,\"=\"&$Y$7))","v":""},{"$nulls":3},{"$f":"IF(SUMIFS(Register!$AL$10:$AL$1048576,Register!$AF$10:$AF$1048576,\">=\"&$C11,Register!$AF$10:$AF$1048576,\"<=\"&$H11,Register!$AB$10:$AB$1048576,\"=\"&$AC$7)=0,\"\",SUMIFS(Register!$AL$10:$AL$1048576,Register!$AF$10:$AF$1048576,\">=\"&$C11,Register!$AF$10:$AF$1048576,\"<=\"&$H11,Register!$AB$10:$AB$1048576,\"=\"&$AC$7))","v":""},{"$nulls":3},{"$f":"IF(SUMIFS(Register!$AL$10:$AL$1048576,Register!$AF$10:$AF$1048576,\">=\"&$C11,Register!$AF$10:$AF$1048576,\"<=\"&$H11,Register!$AB$10:$AB$1048576,\"=\"&$AG$7)=0,\"\",SUMIFS(Register!$AL$10:$AL$1048576,Register!$AF$10:$AF$1048576,\">=\"&$C11,Register!$AF$10:$AF$1048576,\"<=\"&$H11,Register!$AB$10:$AB$1048576,\"=\"&$AG$7))","v":""},{"$nulls":3},{"$f":"IF(SUMIFS(Register!$AL$10:$AL$1048576,Register!$AF$10:$AF$1048576,\">=\"&$C11,Register!$AF$10:$AF$1048576,\"<=\"&$H11,Register!$AB$10:$AB$1048576,\"=\"&$AK$7)=0,\"\",SUMIFS(Register!$AL$10:$AL$1048576,Register!$AF$10:$AF$1048576,\">=\"&$C11,Register!$AF$10:$AF$1048576,\"<=\"&$H11,Register!$AB$10:$AB$1048576,\"=\"&$AK$7))","v":""}]
[{"v":3,"d":"0003"},null,{"$f":"EDATE(C11,1)","v":"2015-03-01"},{"$nulls":4},"2015-03-31",{"$nulls":4},{"$f":"IF(SUMIFS(Register!$AL$10:$AL$1048576,Register!$AF$10:$AF$1048576,\">=\"&C12,Register!$AF$10:$AF$1048576,\"<=\"&H12)=0,\"\",SUMIFS(Register!$AL$10:$AL$1048576,Register!$AF$10:$AF$1048576,\">=\"&C12,Register!$AF$10:$AF$1048576,\"<=\"&H12))","v":""},{"$nulls":3},"",{"$nulls":3},{"$f":"IF(SUMIFS(Register!$AL$10:$AL$1048576,Register!$AF$10:$AF$1048576,\">=\"&$C12,Register!$AF$10:$AF$1048576,\"<=\"&$H12,Register!$AB$10:$AB$1048576,\"=\"&$U$7)=0,\"\",SUMIFS(Register!$AL$10:$AL$1048576,Register!$AF$10:$AF$1048576,\">=\"&$C12,Register!$AF$10:$AF$1048576,\"<=\"&$H12,Register!$AB$10:$AB$1048576,\"=\"&$U$7))","v":""},{"$nulls":3},{"$f":"IF(SUMIFS(Register!$AL$10:$AL$1048576,Register!$AF$10:$AF$1048576,\">=\"&$C12,Register!$AF$10:$AF$1048576,\"<=\"&$H12,Register!$AB$10:$AB$1048576,\"=\"&$Y$7)=0,\"\",SUMIFS(Register!$AL$10:$AL$1048576,Register!$AF$10:$AF$1048576,\">=\"&$C12,Register!$AF$10:$AF$1048576,\"<=\"&$H12,Register!$AB$10:$AB$1048576,\"=\"&$Y$7))","v":""},{"$nulls":3},{"$f":"IF(SUMIFS(Register!$AL$10:$AL$1048576,Register!$AF$10:$AF$1048576,\">=\"&$C12,Register!$AF$10:$AF$1048576,\"<=\"&$H12,Register!$AB$10:$AB$1048576,\"=\"&$AC$7)=0,\"\",SUMIFS(Register!$AL$10:$AL$1048576,Register!$AF$10:$AF$1048576,\">=\"&$C12,Register!$AF$10:$AF$1048576,\"<=\"&$H12,Register!$AB$10:$AB$1048576,\"=\"&$AC$7))","v":""},{"$nulls":3},{"$f":"IF(SUMIFS(Register!$AL$10:$AL$1048576,Register!$AF$10:$AF$1048576,\">=\"&$C12,Register!$AF$10:$AF$1048576,\"<=\"&$H12,Register!$AB$10:$AB$1048576,\"=\"&$AG$7)=0,\"\",SUMIFS(Register!$AL$10:$AL$1048576,Register!$AF$10:$AF$1048576,\">=\"&$C12,Register!$AF$10:$AF$1048576,\"<=\"&$H12,Register!$AB$10:$AB$1048576,\"=\"&$AG$7))","v":""},{"$nulls":3},{"$f":"IF(SUMIFS(Register!$AL$10:$AL$1048576,Register!$AF$10:$AF$1048576,\">=\"&$C12,Register!$AF$10:$AF$1048576,\"<=\"&$H12,Register!$AB$10:$AB$1048576,\"=\"&$AK$7)=0,\"\",SUMIFS(Register!$AL$10:$AL$1048576,Register!$AF$10:$AF$1048576,\">=\"&$C12,Register!$AF$10:$AF$1048576,\"<=\"&$H12,Register!$AB$10:$AB$1048576,\"=\"&$AK$7))","v":""}]
[{"v":4,"d":"0004"},null,"2015-04-01",{"$nulls":4},"2015-04-30",{"$nulls":4},{"$f":"IF(SUMIFS(Register!$AL$10:$AL$1048576,Register!$AF$10:$AF$1048576,\">=\"&C13,Register!$AF$10:$AF$1048576,\"<=\"&H13)=0,\"\",SUMIFS(Register!$AL$10:$AL$1048576,Register!$AF$10:$AF$1048576,\">=\"&C13,Register!$AF$10:$AF$1048576,\"<=\"&H13))","v":""},{"$nulls":3},"",{"$nulls":3},{"$f":"IF(SUMIFS(Register!$AL$10:$AL$1048576,Register!$AF$10:$AF$1048576,\">=\"&$C13,Register!$AF$10:$AF$1048576,\"<=\"&$H13,Register!$AB$10:$AB$1048576,\"=\"&$U$7)=0,\"\",SUMIFS(Register!$AL$10:$AL$1048576,Register!$AF$10:$AF$1048576,\">=\"&$C13,Register!$AF$10:$AF$1048576,\"<=\"&$H13,Register!$AB$10:$AB$1048576,\"=\"&$U$7))","v":""},{"$nulls":3},{"$f":"IF(SUMIFS(Register!$AL$10:$AL$1048576,Register!$AF$10:$AF$1048576,\">=\"&$C13,Register!$AF$10:$AF$1048576,\"<=\"&$H13,Register!$AB$10:$AB$1048576,\"=\"&$Y$7)=0,\"\",SUMIFS(Register!$AL$10:$AL$1048576,Register!$AF$10:$AF$1048576,\">=\"&$C13,Register!$AF$10:$AF$1048576,\"<=\"&$H13,Register!$AB$10:$AB$1048576,\"=\"&$Y$7))","v":""},{"$nulls":3},{"$f":"IF(SUMIFS(Register!$AL$10:$AL$1048576,Register!$AF$10:$AF$1048576,\">=\"&$C13,Register!$AF$10:$AF$1048576,\"<=\"&$H13,Register!$AB$10:$AB$1048576,\"=\"&$AC$7)=0,\"\",SUMIFS(Register!$AL$10:$AL$1048576,Register!$AF$10:$AF$1048576,\">=\"&$C13,Register!$AF$10:$AF$1048576,\"<=\"&$H13,Register!$AB$10:$AB$1048576,\"=\"&$AC$7))","v":""},{"$nulls":3},{"$f":"IF(SUMIFS(Register!$AL$10:$AL$1048576,Register!$AF$10:$AF$1048576,\">=\"&$C13,Register!$AF$10:$AF$1048576,\"<=\"&$H13,Register!$AB$10:$AB$1048576,\"=\"&$AG$7)=0,\"\",SUMIFS(Register!$AL$10:$AL$1048576,Register!$AF$10:$AF$1048576,\">=\"&$C13,Register!$AF$10:$AF$1048576,\"<=\"&$H13,Register!$AB$10:$AB$1048576,\"=\"&$AG$7))","v":""},{"$nulls":3},{"$f":"IF(SUMIFS(Register!$AL$10:$AL$1048576,Register!$AF$10:$AF$1048576,\">=\"&$C13,Register!$AF$10:$AF$1048576,\"<=\"&$H13,Register!$AB$10:$AB$1048576,\"=\"&$AK$7)=0,\"\",SUMIFS(Register!$AL$10:$AL$1048576,Register!$AF$10:$AF$1048576,\">=\"&$C13,Register!$AF$10:$AF$1048576,\"<=\"&$H13,Register!$AB$10:$AB$1048576,\"=\"&$AK$7))","v":""}]
[{"v":5,"d":"0005"},null,"2015-05-01",{"$nulls":4},"2015-05-31",{"$nulls":4},{"$f":"IF(SUMIFS(Register!$AL$10:$AL$1048576,Register!$AF$10:$AF$1048576,\">=\"&C14,Register!$AF$10:$AF$1048576,\"<=\"&H14)=0,\"\",SUMIFS(Register!$AL$10:$AL$1048576,Register!$AF$10:$AF$1048576,\">=\"&C14,Register!$AF$10:$AF$1048576,\"<=\"&H14))","v":""},{"$nulls":3},"",{"$nulls":3},{"$f":"IF(SUMIFS(Register!$AL$10:$AL$1048576,Register!$AF$10:$AF$1048576,\">=\"&$C14,Register!$AF$10:$AF$1048576,\"<=\"&$H14,Register!$AB$10:$AB$1048576,\"=\"&$U$7)=0,\"\",SUMIFS(Register!$AL$10:$AL$1048576,Register!$AF$10:$AF$1048576,\">=\"&$C14,Register!$AF$10:$AF$1048576,\"<=\"&$H14,Register!$AB$10:$AB$1048576,\"=\"&$U$7))","v":""},{"$nulls":3},{"$f":"IF(SUMIFS(Register!$AL$10:$AL$1048576,Register!$AF$10:$AF$1048576,\">=\"&$C14,Register!$AF$10:$AF$1048576,\"<=\"&$H14,Register!$AB$10:$AB$1048576,\"=\"&$Y$7)=0,\"\",SUMIFS(Register!$AL$10:$AL$1048576,Register!$AF$10:$AF$1048576,\">=\"&$C14,Register!$AF$10:$AF$1048576,\"<=\"&$H14,Register!$AB$10:$AB$1048576,\"=\"&$Y$7))","v":""},{"$nulls":3},{"$f":"IF(SUMIFS(Register!$AL$10:$AL$1048576,Register!$AF$10:$AF$1048576,\">=\"&$C14,Register!$AF$10:$AF$1048576,\"<=\"&$H14,Register!$AB$10:$AB$1048576,\"=\"&$AC$7)=0,\"\",SUMIFS(Register!$AL$10:$AL$1048576,Register!$AF$10:$AF$1048576,\">=\"&$C14,Register!$AF$10:$AF$1048576,\"<=\"&$H14,Register!$AB$10:$AB$1048576,\"=\"&$AC$7))","v":""},{"$nulls":3},{"$f":"IF(SUMIFS(Register!$AL$10:$AL$1048576,Register!$AF$10:$AF$1048576,\">=\"&$C14,Register!$AF$10:$AF$1048576,\"<=\"&$H14,Register!$AB$10:$AB$1048576,\"=\"&$AG$7)=0,\"\",SUMIFS(Register!$AL$10:$AL$1048576,Register!$AF$10:$AF$1048576,\">=\"&$C14,Register!$AF$10:$AF$1048576,\"<=\"&$H14,Register!$AB$10:$AB$1048576,\"=\"&$AG$7))","v":""},{"$nulls":3},{"$f":"IF(SUMIFS(Register!$AL$10:$AL$1048576,Register!$AF$10:$AF$1048576,\">=\"&$C14,Register!$AF$10:$AF$1048576,\"<=\"&$H14,Register!$AB$10:$AB$1048576,\"=\"&$AK$7)=0,\"\",SUMIFS(Register!$AL$10:$AL$1048576,Register!$AF$10:$AF$1048576,\">=\"&$C14,Register!$AF$10:$AF$1048576,\"<=\"&$H14,Register!$AB$10:$AB$1048576,\"=\"&$AK$7))","v":""}]
[{"v":6,"d":"0006"},null,"2015-06-01",{"$nulls":4},"2015-06-30",{"$nulls":4},{"$f":"IF(SUMIFS(Register!$AL$10:$AL$1048576,Register!$AF$10:$AF$1048576,\">=\"&C15,Register!$AF$10:$AF$1048576,\"<=\"&H15)=0,\"\",SUMIFS(Register!$AL$10:$AL$1048576,Register!$AF$10:$AF$1048576,\">=\"&C15,Register!$AF$10:$AF$1048576,\"<=\"&H15))","v":""},{"$nulls":3},"",{"$nulls":3},{"$f":"IF(SUMIFS(Register!$AL$10:$AL$1048576,Register!$AF$10:$AF$1048576,\">=\"&$C15,Register!$AF$10:$AF$1048576,\"<=\"&$H15,Register!$AB$10:$AB$1048576,\"=\"&$U$7)=0,\"\",SUMIFS(Register!$AL$10:$AL$1048576,Register!$AF$10:$AF$1048576,\">=\"&$C15,Register!$AF$10:$AF$1048576,\"<=\"&$H15,Register!$AB$10:$AB$1048576,\"=\"&$U$7))","v":""},{"$nulls":3},{"$f":"IF(SUMIFS(Register!$AL$10:$AL$1048576,Register!$AF$10:$AF$1048576,\">=\"&$C15,Register!$AF$10:$AF$1048576,\"<=\"&$H15,Register!$AB$10:$AB$1048576,\"=\"&$Y$7)=0,\"\",SUMIFS(Register!$AL$10:$AL$1048576,Register!$AF$10:$AF$1048576,\">=\"&$C15,Register!$AF$10:$AF$1048576,\"<=\"&$H15,Register!$AB$10:$AB$1048576,\"=\"&$Y$7))","v":""},{"$nulls":3},{"$f":"IF(SUMIFS(Register!$AL$10:$AL$1048576,Register!$AF$10:$AF$1048576,\">=\"&$C15,Register!$AF$10:$AF$1048576,\"<=\"&$H15,Register!$AB$10:$AB$1048576,\"=\"&$AC$7)=0,\"\",SUMIFS(Register!$AL$10:$AL$1048576,Register!$AF$10:$AF$1048576,\">=\"&$C15,Register!$AF$10:$AF$1048576,\"<=\"&$H15,Register!$AB$10:$AB$1048576,\"=\"&$AC$7))","v":""},{"$nulls":3},{"$f":"IF(SUMIFS(Register!$AL$10:$AL$1048576,Register!$AF$10:$AF$1048576,\">=\"&$C15,Register!$AF$10:$AF$1048576,\"<=\"&$H15,Register!$AB$10:$AB$1048576,\"=\"&$AG$7)=0,\"\",SUMIFS(Register!$AL$10:$AL$1048576,Register!$AF$10:$AF$1048576,\">=\"&$C15,Register!$AF$10:$AF$1048576,\"<=\"&$H15,Register!$AB$10:$AB$1048576,\"=\"&$AG$7))","v":""},{"$nulls":3},{"$f":"IF(SUMIFS(Register!$AL$10:$AL$1048576,Register!$AF$10:$AF$1048576,\">=\"&$C15,Register!$AF$10:$AF$1048576,\"<=\"&$H15,Register!$AB$10:$AB$1048576,\"=\"&$AK$7)=0,\"\",SUMIFS(Register!$AL$10:$AL$1048576,Register!$AF$10:$AF$1048576,\">=\"&$C15,Register!$AF$10:$AF$1048576,\"<=\"&$H15,Register!$AB$10:$AB$1048576,\"=\"&$AK$7))","v":""}]
[{"v":7,"d":"0007"},null,"2015-07-01",{"$nulls":4},"2015-07-31",{"$nulls":4},{"$f":"IF(SUMIFS(Register!$AL$10:$AL$1048576,Register!$AF$10:$AF$1048576,\">=\"&C16,Register!$AF$10:$AF$1048576,\"<=\"&H16)=0,\"\",SUMIFS(Register!$AL$10:$AL$1048576,Register!$AF$10:$AF$1048576,\">=\"&C16,Register!$AF$10:$AF$1048576,\"<=\"&H16))","v":""},{"$nulls":3},"",{"$nulls":3},{"$f":"IF(SUMIFS(Register!$AL$10:$AL$1048576,Register!$AF$10:$AF$1048576,\">=\"&$C16,Register!$AF$10:$AF$1048576,\"<=\"&$H16,Register!$AB$10:$AB$1048576,\"=\"&$U$7)=0,\"\",SUMIFS(Register!$AL$10:$AL$1048576,Register!$AF$10:$AF$1048576,\">=\"&$C16,Register!$AF$10:$AF$1048576,\"<=\"&$H16,Register!$AB$10:$AB$1048576,\"=\"&$U$7))","v":""},{"$nulls":3},{"$f":"IF(SUMIFS(Register!$AL$10:$AL$1048576,Register!$AF$10:$AF$1048576,\">=\"&$C16,Register!$AF$10:$AF$1048576,\"<=\"&$H16,Register!$AB$10:$AB$1048576,\"=\"&$Y$7)=0,\"\",SUMIFS(Register!$AL$10:$AL$1048576,Register!$AF$10:$AF$1048576,\">=\"&$C16,Register!$AF$10:$AF$1048576,\"<=\"&$H16,Register!$AB$10:$AB$1048576,\"=\"&$Y$7))","v":""},{"$nulls":3},{"$f":"IF(SUMIFS(Register!$AL$10:$AL$1048576,Register!$AF$10:$AF$1048576,\">=\"&$C16,Register!$AF$10:$AF$1048576,\"<=\"&$H16,Register!$AB$10:$AB$1048576,\"=\"&$AC$7)=0,\"\",SUMIFS(Register!$AL$10:$AL$1048576,Register!$AF$10:$AF$1048576,\">=\"&$C16,Register!$AF$10:$AF$1048576,\"<=\"&$H16,Register!$AB$10:$AB$1048576,\"=\"&$AC$7))","v":""},{"$nulls":3},{"$f":"IF(SUMIFS(Register!$AL$10:$AL$1048576,Register!$AF$10:$AF$1048576,\">=\"&$C16,Register!$AF$10:$AF$1048576,\"<=\"&$H16,Register!$AB$10:$AB$1048576,\"=\"&$AG$7)=0,\"\",SUMIFS(Register!$AL$10:$AL$1048576,Register!$AF$10:$AF$1048576,\">=\"&$C16,Register!$AF$10:$AF$1048576,\"<=\"&$H16,Register!$AB$10:$AB$1048576,\"=\"&$AG$7))","v":""},{"$nulls":3},{"$f":"IF(SUMIFS(Register!$AL$10:$AL$1048576,Register!$AF$10:$AF$1048576,\">=\"&$C16,Register!$AF$10:$AF$1048576,\"<=\"&$H16,Register!$AB$10:$AB$1048576,\"=\"&$AK$7)=0,\"\",SUMIFS(Register!$AL$10:$AL$1048576,Register!$AF$10:$AF$1048576,\">=\"&$C16,Register!$AF$10:$AF$1048576,\"<=\"&$H16,Register!$AB$10:$AB$1048576,\"=\"&$AK$7))","v":""}]
[{"v":8,"d":"0008"},null,{"$f":"EDATE(C16,1)","v":"2015-08-01"},{"$nulls":4},{"$f":"EDATE(C17,1)-1","v":"2015-08-31"},{"$nulls":4},{"$f":"IF(SUMIFS(Register!$AL$10:$AL$1048576,Register!$AF$10:$AF$1048576,\">=\"&C17,Register!$AF$10:$AF$1048576,\"<=\"&H17)=0,\"\",SUMIFS(Register!$AL$10:$AL$1048576,Register!$AF$10:$AF$1048576,\">=\"&C17,Register!$AF$10:$AF$1048576,\"<=\"&H17))","v":""},{"$nulls":3},"",{"$nulls":3},{"$f":"IF(SUMIFS(Register!$AL$10:$AL$1048576,Register!$AF$10:$AF$1048576,\">=\"&$C17,Register!$AF$10:$AF$1048576,\"<=\"&$H17,Register!$AB$10:$AB$1048576,\"=\"&$U$7)=0,\"\",SUMIFS(Register!$AL$10:$AL$1048576,Register!$AF$10:$AF$1048576,\">=\"&$C17,Register!$AF$10:$AF$1048576,\"<=\"&$H17,Register!$AB$10:$AB$1048576,\"=\"&$U$7))","v":""},{"$nulls":3},{"$f":"IF(SUMIFS(Register!$AL$10:$AL$1048576,Register!$AF$10:$AF$1048576,\">=\"&$C17,Register!$AF$10:$AF$1048576,\"<=\"&$H17,Register!$AB$10:$AB$1048576,\"=\"&$Y$7)=0,\"\",SUMIFS(Register!$AL$10:$AL$1048576,Register!$AF$10:$AF$1048576,\">=\"&$C17,Register!$AF$10:$AF$1048576,\"<=\"&$H17,Register!$AB$10:$AB$1048576,\"=\"&$Y$7))","v":""},{"$nulls":3},{"$f":"IF(SUMIFS(Register!$AL$10:$AL$1048576,Register!$AF$10:$AF$1048576,\">=\"&$C17,Register!$AF$10:$AF$1048576,\"<=\"&$H17,Register!$AB$10:$AB$1048576,\"=\"&$AC$7)=0,\"\",SUMIFS(Register!$AL$10:$AL$1048576,Register!$AF$10:$AF$1048576,\">=\"&$C17,Register!$AF$10:$AF$1048576,\"<=\"&$H17,Register!$AB$10:$AB$1048576,\"=\"&$AC$7))","v":""},{"$nulls":3},{"$f":"IF(SUMIFS(Register!$AL$10:$AL$1048576,Register!$AF$10:$AF$1048576,\">=\"&$C17,Register!$AF$10:$AF$1048576,\"<=\"&$H17,Register!$AB$10:$AB$1048576,\"=\"&$AG$7)=0,\"\",SUMIFS(Register!$AL$10:$AL$1048576,Register!$AF$10:$AF$1048576,\">=\"&$C17,Register!$AF$10:$AF$1048576,\"<=\"&$H17,Register!$AB$10:$AB$1048576,\"=\"&$AG$7))","v":""},{"$nulls":3},{"$f":"IF(SUMIFS(Register!$AL$10:$AL$1048576,Register!$AF$10:$AF$1048576,\">=\"&$C17,Register!$AF$10:$AF$1048576,\"<=\"&$H17,Register!$AB$10:$AB$1048576,\"=\"&$AK$7)=0,\"\",SUMIFS(Register!$AL$10:$AL$1048576,Register!$AF$10:$AF$1048576,\">=\"&$C17,Register!$AF$10:$AF$1048576,\"<=\"&$H17,Register!$AB$10:$AB$1048576,\"=\"&$AK$7))","v":""}]
[{"v":9,"d":"0009"},null,"2015-09-01",{"$nulls":4},"2015-09-30",{"$nulls":4},{"$f":"IF(SUMIFS(Register!$AL$10:$AL$1048576,Register!$AF$10:$AF$1048576,\">=\"&C18,Register!$AF$10:$AF$1048576,\"<=\"&H18)=0,\"\",SUMIFS(Register!$AL$10:$AL$1048576,Register!$AF$10:$AF$1048576,\">=\"&C18,Register!$AF$10:$AF$1048576,\"<=\"&H18))","v":""},{"$nulls":3},"",{"$nulls":3},{"$f":"IF(SUMIFS(Register!$AL$10:$AL$1048576,Register!$AF$10:$AF$1048576,\">=\"&$C18,Register!$AF$10:$AF$1048576,\"<=\"&$H18,Register!$AB$10:$AB$1048576,\"=\"&$U$7)=0,\"\",SUMIFS(Register!$AL$10:$AL$1048576,Register!$AF$10:$AF$1048576,\">=\"&$C18,Register!$AF$10:$AF$1048576,\"<=\"&$H18,Register!$AB$10:$AB$1048576,\"=\"&$U$7))","v":""},{"$nulls":3},{"$f":"IF(SUMIFS(Register!$AL$10:$AL$1048576,Register!$AF$10:$AF$1048576,\">=\"&$C18,Register!$AF$10:$AF$1048576,\"<=\"&$H18,Register!$AB$10:$AB$1048576,\"=\"&$Y$7)=0,\"\",SUMIFS(Register!$AL$10:$AL$1048576,Register!$AF$10:$AF$1048576,\">=\"&$C18,Register!$AF$10:$AF$1048576,\"<=\"&$H18,Register!$AB$10:$AB$1048576,\"=\"&$Y$7))","v":""},{"$nulls":3},{"$f":"IF(SUMIFS(Register!$AL$10:$AL$1048576,Register!$AF$10:$AF$1048576,\">=\"&$C18,Register!$AF$10:$AF$1048576,\"<=\"&$H18,Register!$AB$10:$AB$1048576,\"=\"&$AC$7)=0,\"\",SUMIFS(Register!$AL$10:$AL$1048576,Register!$AF$10:$AF$1048576,\">=\"&$C18,Register!$AF$10:$AF$1048576,\"<=\"&$H18,Register!$AB$10:$AB$1048576,\"=\"&$AC$7))","v":""},{"$nulls":3},{"$f":"IF(SUMIFS(Register!$AL$10:$AL$1048576,Register!$AF$10:$AF$1048576,\">=\"&$C18,Register!$AF$10:$AF$1048576,\"<=\"&$H18,Register!$AB$10:$AB$1048576,\"=\"&$AG$7)=0,\"\",SUMIFS(Register!$AL$10:$AL$1048576,Register!$AF$10:$AF$1048576,\">=\"&$C18,Register!$AF$10:$AF$1048576,\"<=\"&$H18,Register!$AB$10:$AB$1048576,\"=\"&$AG$7))","v":""},{"$nulls":3},{"$f":"IF(SUMIFS(Register!$AL$10:$AL$1048576,Register!$AF$10:$AF$1048576,\">=\"&$C18,Register!$AF$10:$AF$1048576,\"<=\"&$H18,Register!$AB$10:$AB$1048576,\"=\"&$AK$7)=0,\"\",SUMIFS(Register!$AL$10:$AL$1048576,Register!$AF$10:$AF$1048576,\">=\"&$C18,Register!$AF$10:$AF$1048576,\"<=\"&$H18,Register!$AB$10:$AB$1048576,\"=\"&$AK$7))","v":""}]
[{"v":10,"d":"0010"},null,"2015-10-01",{"$nulls":4},"2015-10-31",{"$nulls":4},{"$f":"IF(SUMIFS(Register!$AL$10:$AL$1048576,Register!$AF$10:$AF$1048576,\">=\"&C19,Register!$AF$10:$AF$1048576,\"<=\"&H19)=0,\"\",SUMIFS(Register!$AL$10:$AL$1048576,Register!$AF$10:$AF$1048576,\">=\"&C19,Register!$AF$10:$AF$1048576,\"<=\"&H19))","v":""},{"$nulls":3},"",{"$nulls":3},{"$f":"IF(SUMIFS(Register!$AL$10:$AL$1048576,Register!$AF$10:$AF$1048576,\">=\"&$C19,Register!$AF$10:$AF$1048576,\"<=\"&$H19,Register!$AB$10:$AB$1048576,\"=\"&$U$7)=0,\"\",SUMIFS(Register!$AL$10:$AL$1048576,Register!$AF$10:$AF$1048576,\">=\"&$C19,Register!$AF$10:$AF$1048576,\"<=\"&$H19,Register!$AB$10:$AB$1048576,\"=\"&$U$7))","v":""},{"$nulls":3},{"$f":"IF(SUMIFS(Register!$AL$10:$AL$1048576,Register!$AF$10:$AF$1048576,\">=\"&$C19,Register!$AF$10:$AF$1048576,\"<=\"&$H19,Register!$AB$10:$AB$1048576,\"=\"&$Y$7)=0,\"\",SUMIFS(Register!$AL$10:$AL$1048576,Register!$AF$10:$AF$1048576,\">=\"&$C19,Register!$AF$10:$AF$1048576,\"<=\"&$H19,Register!$AB$10:$AB$1048576,\"=\"&$Y$7))","v":""},{"$nulls":3},{"$f":"IF(SUMIFS(Register!$AL$10:$AL$1048576,Register!$AF$10:$AF$1048576,\">=\"&$C19,Register!$AF$10:$AF$1048576,\"<=\"&$H19,Register!$AB$10:$AB$1048576,\"=\"&$AC$7)=0,\"\",SUMIFS(Register!$AL$10:$AL$1048576,Register!$AF$10:$AF$1048576,\">=\"&$C19,Register!$AF$10:$AF$1048576,\"<=\"&$H19,Register!$AB$10:$AB$1048576,\"=\"&$AC$7))","v":""},{"$nulls":3},{"$f":"IF(SUMIFS(Register!$AL$10:$AL$1048576,Register!$AF$10:$AF$1048576,\">=\"&$C19,Register!$AF$10:$AF$1048576,\"<=\"&$H19,Register!$AB$10:$AB$1048576,\"=\"&$AG$7)=0,\"\",SUMIFS(Register!$AL$10:$AL$1048576,Register!$AF$10:$AF$1048576,\">=\"&$C19,Register!$AF$10:$AF$1048576,\"<=\"&$H19,Register!$AB$10:$AB$1048576,\"=\"&$AG$7))","v":""},{"$nulls":3},{"$f":"IF(SUMIFS(Register!$AL$10:$AL$1048576,Register!$AF$10:$AF$1048576,\">=\"&$C19,Register!$AF$10:$AF$1048576,\"<=\"&$H19,Register!$AB$10:$AB$1048576,\"=\"&$AK$7)=0,\"\",SUMIFS(Register!$AL$10:$AL$1048576,Register!$AF$10:$AF$1048576,\">=\"&$C19,Register!$AF$10:$AF$1048576,\"<=\"&$H19,Register!$AB$10:$AB$1048576,\"=\"&$AK$7))","v":""}]
[{"v":11,"d":"0011"},null,"2015-11-01",{"$nulls":4},"2015-11-30",{"$nulls":4},{"$f":"IF(SUMIFS(Register!$AL$10:$AL$1048576,Register!$AF$10:$AF$1048576,\">=\"&C20,Register!$AF$10:$AF$1048576,\"<=\"&H20)=0,\"\",SUMIFS(Register!$AL$10:$AL$1048576,Register!$AF$10:$AF$1048576,\">=\"&C20,Register!$AF$10:$AF$1048576,\"<=\"&H20))","v":""},{"$nulls":3},"",{"$nulls":3},{"$f":"IF(SUMIFS(Register!$AL$10:$AL$1048576,Register!$AF$10:$AF$1048576,\">=\"&$C20,Register!$AF$10:$AF$1048576,\"<=\"&$H20,Register!$AB$10:$AB$1048576,\"=\"&$U$7)=0,\"\",SUMIFS(Register!$AL$10:$AL$1048576,Register!$AF$10:$AF$1048576,\">=\"&$C20,Register!$AF$10:$AF$1048576,\"<=\"&$H20,Register!$AB$10:$AB$1048576,\"=\"&$U$7))","v":""},{"$nulls":3},{"$f":"IF(SUMIFS(Register!$AL$10:$AL$1048576,Register!$AF$10:$AF$1048576,\">=\"&$C20,Register!$AF$10:$AF$1048576,\"<=\"&$H20,Register!$AB$10:$AB$1048576,\"=\"&$Y$7)=0,\"\",SUMIFS(Register!$AL$10:$AL$1048576,Register!$AF$10:$AF$1048576,\">=\"&$C20,Register!$AF$10:$AF$1048576,\"<=\"&$H20,Register!$AB$10:$AB$1048576,\"=\"&$Y$7))","v":""},{"$nulls":3},{"$f":"IF(SUMIFS(Register!$AL$10:$AL$1048576,Register!$AF$10:$AF$1048576,\">=\"&$C20,Register!$AF$10:$AF$1048576,\"<=\"&$H20,Register!$AB$10:$AB$1048576,\"=\"&$AC$7)=0,\"\",SUMIFS(Register!$AL$10:$AL$1048576,Register!$AF$10:$AF$1048576,\">=\"&$C20,Register!$AF$10:$AF$1048576,\"<=\"&$H20,Register!$AB$10:$AB$1048576,\"=\"&$AC$7))","v":""},{"$nulls":3},{"$f":"IF(SUMIFS(Register!$AL$10:$AL$1048576,Register!$AF$10:$AF$1048576,\">=\"&$C20,Register!$AF$10:$AF$1048576,\"<=\"&$H20,Register!$AB$10:$AB$1048576,\"=\"&$AG$7)=0,\"\",SUMIFS(Register!$AL$10:$AL$1048576,Register!$AF$10:$AF$1048576,\">=\"&$C20,Register!$AF$10:$AF$1048576,\"<=\"&$H20,Register!$AB$10:$AB$1048576,\"=\"&$AG$7))","v":""},{"$nulls":3},{"$f":"IF(SUMIFS(Register!$AL$10:$AL$1048576,Register!$AF$10:$AF$1048576,\">=\"&$C20,Register!$AF$10:$AF$1048576,\"<=\"&$H20,Register!$AB$10:$AB$1048576,\"=\"&$AK$7)=0,\"\",SUMIFS(Register!$AL$10:$AL$1048576,Register!$AF$10:$AF$1048576,\">=\"&$C20,Register!$AF$10:$AF$1048576,\"<=\"&$H20,Register!$AB$10:$AB$1048576,\"=\"&$AK$7))","v":""}]
[{"v":12,"d":"0012"},null,"2015-12-01",{"$nulls":4},"2015-12-31",{"$nulls":4},{"$f":"IF(SUMIFS(Register!$AL$10:$AL$1048576,Register!$AF$10:$AF$1048576,\">=\"&C21,Register!$AF$10:$AF$1048576,\"<=\"&H21)=0,\"\",SUMIFS(Register!$AL$10:$AL$1048576,Register!$AF$10:$AF$1048576,\">=\"&C21,Register!$AF$10:$AF$1048576,\"<=\"&H21))","v":""},{"$nulls":3},"",{"$nulls":3},{"$f":"IF(SUMIFS(Register!$AL$10:$AL$1048576,Register!$AF$10:$AF$1048576,\">=\"&$C21,Register!$AF$10:$AF$1048576,\"<=\"&$H21,Register!$AB$10:$AB$1048576,\"=\"&$U$7)=0,\"\",SUMIFS(Register!$AL$10:$AL$1048576,Register!$AF$10:$AF$1048576,\">=\"&$C21,Register!$AF$10:$AF$1048576,\"<=\"&$H21,Register!$AB$10:$AB$1048576,\"=\"&$U$7))","v":""},{"$nulls":3},{"$f":"IF(SUMIFS(Register!$AL$10:$AL$1048576,Register!$AF$10:$AF$1048576,\">=\"&$C21,Register!$AF$10:$AF$1048576,\"<=\"&$H21,Register!$AB$10:$AB$1048576,\"=\"&$Y$7)=0,\"\",SUMIFS(Register!$AL$10:$AL$1048576,Register!$AF$10:$AF$1048576,\">=\"&$C21,Register!$AF$10:$AF$1048576,\"<=\"&$H21,Register!$AB$10:$AB$1048576,\"=\"&$Y$7))","v":""},{"$nulls":3},{"$f":"IF(SUMIFS(Register!$AL$10:$AL$1048576,Register!$AF$10:$AF$1048576,\">=\"&$C21,Register!$AF$10:$AF$1048576,\"<=\"&$H21,Register!$AB$10:$AB$1048576,\"=\"&$AC$7)=0,\"\",SUMIFS(Register!$AL$10:$AL$1048576,Register!$AF$10:$AF$1048576,\">=\"&$C21,Register!$AF$10:$AF$1048576,\"<=\"&$H21,Register!$AB$10:$AB$1048576,\"=\"&$AC$7))","v":""},{"$nulls":3},{"$f":"IF(SUMIFS(Register!$AL$10:$AL$1048576,Register!$AF$10:$AF$1048576,\">=\"&$C21,Register!$AF$10:$AF$1048576,\"<=\"&$H21,Register!$AB$10:$AB$1048576,\"=\"&$AG$7)=0,\"\",SUMIFS(Register!$AL$10:$AL$1048576,Register!$AF$10:$AF$1048576,\">=\"&$C21,Register!$AF$10:$AF$1048576,\"<=\"&$H21,Register!$AB$10:$AB$1048576,\"=\"&$AG$7))","v":""},{"$nulls":3},{"$f":"IF(SUMIFS(Register!$AL$10:$AL$1048576,Register!$AF$10:$AF$1048576,\">=\"&$C21,Register!$AF$10:$AF$1048576,\"<=\"&$H21,Register!$AB$10:$AB$1048576,\"=\"&$AK$7)=0,\"\",SUMIFS(Register!$AL$10:$AL$1048576,Register!$AF$10:$AF$1048576,\">=\"&$C21,Register!$AF$10:$AF$1048576,\"<=\"&$H21,Register!$AB$10:$AB$1048576,\"=\"&$AK$7))","v":""}]
[{"v":13,"d":"0013"},null,{"$f":"EDATE(C21,1)","v":"2016-01-01"},{"$nulls":4},{"$f":"EDATE(C22,1)-1","v":"2016-01-31"},{"$nulls":4},{"$f":"IF(SUMIFS(Register!$AL$10:$AL$1048576,Register!$AF$10:$AF$1048576,\">=\"&C22,Register!$AF$10:$AF$1048576,\"<=\"&H22)=0,\"\",SUMIFS(Register!$AL$10:$AL$1048576,Register!$AF$10:$AF$1048576,\">=\"&C22,Register!$AF$10:$AF$1048576,\"<=\"&H22))","v":""},{"$nulls":3},"",{"$nulls":3},{"$f":"IF(SUMIFS(Register!$AL$10:$AL$1048576,Register!$AF$10:$AF$1048576,\">=\"&$C22,Register!$AF$10:$AF$1048576,\"<=\"&$H22,Register!$AB$10:$AB$1048576,\"=\"&$U$7)=0,\"\",SUMIFS(Register!$AL$10:$AL$1048576,Register!$AF$10:$AF$1048576,\">=\"&$C22,Register!$AF$10:$AF$1048576,\"<=\"&$H22,Register!$AB$10:$AB$1048576,\"=\"&$U$7))","v":""},{"$nulls":3},{"$f":"IF(SUMIFS(Register!$AL$10:$AL$1048576,Register!$AF$10:$AF$1048576,\">=\"&$C22,Register!$AF$10:$AF$1048576,\"<=\"&$H22,Register!$AB$10:$AB$1048576,\"=\"&$Y$7)=0,\"\",SUMIFS(Register!$AL$10:$AL$1048576,Register!$AF$10:$AF$1048576,\">=\"&$C22,Register!$AF$10:$AF$1048576,\"<=\"&$H22,Register!$AB$10:$AB$1048576,\"=\"&$Y$7))","v":""},{"$nulls":3},{"$f":"IF(SUMIFS(Register!$AL$10:$AL$1048576,Register!$AF$10:$AF$1048576,\">=\"&$C22,Register!$AF$10:$AF$1048576,\"<=\"&$H22,Register!$AB$10:$AB$1048576,\"=\"&$AC$7)=0,\"\",SUMIFS(Register!$AL$10:$AL$1048576,Register!$AF$10:$AF$1048576,\">=\"&$C22,Register!$AF$10:$AF$1048576,\"<=\"&$H22,Register!$AB$10:$AB$1048576,\"=\"&$AC$7))","v":""},{"$nulls":3},{"$f":"IF(SUMIFS(Register!$AL$10:$AL$1048576,Register!$AF$10:$AF$1048576,\">=\"&$C22,Register!$AF$10:$AF$1048576,\"<=\"&$H22,Register!$AB$10:$AB$1048576,\"=\"&$AG$7)=0,\"\",SUMIFS(Register!$AL$10:$AL$1048576,Register!$AF$10:$AF$1048576,\">=\"&$C22,Register!$AF$10:$AF$1048576,\"<=\"&$H22,Register!$AB$10:$AB$1048576,\"=\"&$AG$7))","v":""},{"$nulls":3},{"$f":"IF(SUMIFS(Register!$AL$10:$AL$1048576,Register!$AF$10:$AF$1048576,\">=\"&$C22,Register!$AF$10:$AF$1048576,\"<=\"&$H22,Register!$AB$10:$AB$1048576,\"=\"&$AK$7)=0,\"\",SUMIFS(Register!$AL$10:$AL$1048576,Register!$AF$10:$AF$1048576,\">=\"&$C22,Register!$AF$10:$AF$1048576,\"<=\"&$H22,Register!$AB$10:$AB$1048576,\"=\"&$AK$7))","v":""}]
[{"v":14,"d":"0014"},null,"2016-02-01",{"$nulls":4},"2016-02-29",{"$nulls":4},{"$f":"IF(SUMIFS(Register!$AL$10:$AL$1048576,Register!$AF$10:$AF$1048576,\">=\"&C23,Register!$AF$10:$AF$1048576,\"<=\"&H23)=0,\"\",SUMIFS(Register!$AL$10:$AL$1048576,Register!$AF$10:$AF$1048576,\">=\"&C23,Register!$AF$10:$AF$1048576,\"<=\"&H23))","v":""},{"$nulls":3},"",{"$nulls":3},{"$f":"IF(SUMIFS(Register!$AL$10:$AL$1048576,Register!$AF$10:$AF$1048576,\">=\"&$C23,Register!$AF$10:$AF$1048576,\"<=\"&$H23,Register!$AB$10:$AB$1048576,\"=\"&$U$7)=0,\"\",SUMIFS(Register!$AL$10:$AL$1048576,Register!$AF$10:$AF$1048576,\">=\"&$C23,Register!$AF$10:$AF$1048576,\"<=\"&$H23,Register!$AB$10:$AB$1048576,\"=\"&$U$7))","v":""},{"$nulls":3},{"$f":"IF(SUMIFS(Register!$AL$10:$AL$1048576,Register!$AF$10:$AF$1048576,\">=\"&$C23,Register!$AF$10:$AF$1048576,\"<=\"&$H23,Register!$AB$10:$AB$1048576,\"=\"&$Y$7)=0,\"\",SUMIFS(Register!$AL$10:$AL$1048576,Register!$AF$10:$AF$1048576,\">=\"&$C23,Register!$AF$10:$AF$1048576,\"<=\"&$H23,Register!$AB$10:$AB$1048576,\"=\"&$Y$7))","v":""},{"$nulls":3},{"$f":"IF(SUMIFS(Register!$AL$10:$AL$1048576,Register!$AF$10:$AF$1048576,\">=\"&$C23,Register!$AF$10:$AF$1048576,\"<=\"&$H23,Register!$AB$10:$AB$1048576,\"=\"&$AC$7)=0,\"\",SUMIFS(Register!$AL$10:$AL$1048576,Register!$AF$10:$AF$1048576,\">=\"&$C23,Register!$AF$10:$AF$1048576,\"<=\"&$H23,Register!$AB$10:$AB$1048576,\"=\"&$AC$7))","v":""},{"$nulls":3},{"$f":"IF(SUMIFS(Register!$AL$10:$AL$1048576,Register!$AF$10:$AF$1048576,\">=\"&$C23,Register!$AF$10:$AF$1048576,\"<=\"&$H23,Register!$AB$10:$AB$1048576,\"=\"&$AG$7)=0,\"\",SUMIFS(Register!$AL$10:$AL$1048576,Register!$AF$10:$AF$1048576,\">=\"&$C23,Register!$AF$10:$AF$1048576,\"<=\"&$H23,Register!$AB$10:$AB$1048576,\"=\"&$AG$7))","v":""},{"$nulls":3},{"$f":"IF(SUMIFS(Register!$AL$10:$AL$1048576,Register!$AF$10:$AF$1048576,\">=\"&$C23,Register!$AF$10:$AF$1048576,\"<=\"&$H23,Register!$AB$10:$AB$1048576,\"=\"&$AK$7)=0,\"\",SUMIFS(Register!$AL$10:$AL$1048576,Register!$AF$10:$AF$1048576,\">=\"&$C23,Register!$AF$10:$AF$1048576,\"<=\"&$H23,Register!$AB$10:$AB$1048576,\"=\"&$AK$7))","v":""}]
[{"v":15,"d":"0015"},null,"2016-03-01",{"$nulls":4},"2016-03-31",{"$nulls":4},{"$f":"IF(SUMIFS(Register!$AL$10:$AL$1048576,Register!$AF$10:$AF$1048576,\">=\"&C24,Register!$AF$10:$AF$1048576,\"<=\"&H24)=0,\"\",SUMIFS(Register!$AL$10:$AL$1048576,Register!$AF$10:$AF$1048576,\">=\"&C24,Register!$AF$10:$AF$1048576,\"<=\"&H24))","v":""},{"$nulls":3},"",{"$nulls":3},{"$f":"IF(SUMIFS(Register!$AL$10:$AL$1048576,Register!$AF$10:$AF$1048576,\">=\"&$C24,Register!$AF$10:$AF$1048576,\"<=\"&$H24,Register!$AB$10:$AB$1048576,\"=\"&$U$7)=0,\"\",SUMIFS(Register!$AL$10:$AL$1048576,Register!$AF$10:$AF$1048576,\">=\"&$C24,Register!$AF$10:$AF$1048576,\"<=\"&$H24,Register!$AB$10:$AB$1048576,\"=\"&$U$7))","v":""},{"$nulls":3},{"$f":"IF(SUMIFS(Register!$AL$10:$AL$1048576,Register!$AF$10:$AF$1048576,\">=\"&$C24,Register!$AF$10:$AF$1048576,\"<=\"&$H24,Register!$AB$10:$AB$1048576,\"=\"&$Y$7)=0,\"\",SUMIFS(Register!$AL$10:$AL$1048576,Register!$AF$10:$AF$1048576,\">=\"&$C24,Register!$AF$10:$AF$1048576,\"<=\"&$H24,Register!$AB$10:$AB$1048576,\"=\"&$Y$7))","v":""},{"$nulls":3},{"$f":"IF(SUMIFS(Register!$AL$10:$AL$1048576,Register!$AF$10:$AF$1048576,\">=\"&$C24,Register!$AF$10:$AF$1048576,\"<=\"&$H24,Register!$AB$10:$AB$1048576,\"=\"&$AC$7)=0,\"\",SUMIFS(Register!$AL$10:$AL$1048576,Register!$AF$10:$AF$1048576,\">=\"&$C24,Register!$AF$10:$AF$1048576,\"<=\"&$H24,Register!$AB$10:$AB$1048576,\"=\"&$AC$7))","v":""},{"$nulls":3},{"$f":"IF(SUMIFS(Register!$AL$10:$AL$1048576,Register!$AF$10:$AF$1048576,\">=\"&$C24,Register!$AF$10:$AF$1048576,\"<=\"&$H24,Register!$AB$10:$AB$1048576,\"=\"&$AG$7)=0,\"\",SUMIFS(Register!$AL$10:$AL$1048576,Register!$AF$10:$AF$1048576,\">=\"&$C24,Register!$AF$10:$AF$1048576,\"<=\"&$H24,Register!$AB$10:$AB$1048576,\"=\"&$AG$7))","v":""},{"$nulls":3},{"$f":"IF(SUMIFS(Register!$AL$10:$AL$1048576,Register!$AF$10:$AF$1048576,\">=\"&$C24,Register!$AF$10:$AF$1048576,\"<=\"&$H24,Register!$AB$10:$AB$1048576,\"=\"&$AK$7)=0,\"\",SUMIFS(Register!$AL$10:$AL$1048576,Register!$AF$10:$AF$1048576,\">=\"&$C24,Register!$AF$10:$AF$1048576,\"<=\"&$H24,Register!$AB$10:$AB$1048576,\"=\"&$AK$7))","v":""}]
[{"v":16,"d":"0016"},null,"2016-04-01",{"$nulls":4},"2016-04-30",{"$nulls":4},{"$f":"IF(SUMIFS(Register!$AL$10:$AL$1048576,Register!$AF$10:$AF$1048576,\">=\"&C25,Register!$AF$10:$AF$1048576,\"<=\"&H25)=0,\"\",SUMIFS(Register!$AL$10:$AL$1048576,Register!$AF$10:$AF$1048576,\">=\"&C25,Register!$AF$10:$AF$1048576,\"<=\"&H25))","v":""},{"$nulls":3},"",{"$nulls":3},{"$f":"IF(SUMIFS(Register!$AL$10:$AL$1048576,Register!$AF$10:$AF$1048576,\">=\"&$C25,Register!$AF$10:$AF$1048576,\"<=\"&$H25,Register!$AB$10:$AB$1048576,\"=\"&$U$7)=0,\"\",SUMIFS(Register!$AL$10:$AL$1048576,Register!$AF$10:$AF$1048576,\">=\"&$C25,Register!$AF$10:$AF$1048576,\"<=\"&$H25,Register!$AB$10:$AB$1048576,\"=\"&$U$7))","v":""},{"$nulls":3},{"$f":"IF(SUMIFS(Register!$AL$10:$AL$1048576,Register!$AF$10:$AF$1048576,\">=\"&$C25,Register!$AF$10:$AF$1048576,\"<=\"&$H25,Register!$AB$10:$AB$1048576,\"=\"&$Y$7)=0,\"\",SUMIFS(Register!$AL$10:$AL$1048576,Register!$AF$10:$AF$1048576,\">=\"&$C25,Register!$AF$10:$AF$1048576,\"<=\"&$H25,Register!$AB$10:$AB$1048576,\"=\"&$Y$7))","v":""},{"$nulls":3},{"$f":"IF(SUMIFS(Register!$AL$10:$AL$1048576,Register!$AF$10:$AF$1048576,\">=\"&$C25,Register!$AF$10:$AF$1048576,\"<=\"&$H25,Register!$AB$10:$AB$1048576,\"=\"&$AC$7)=0,\"\",SUMIFS(Register!$AL$10:$AL$1048576,Register!$AF$10:$AF$1048576,\">=\"&$C25,Register!$AF$10:$AF$1048576,\"<=\"&$H25,Register!$AB$10:$AB$1048576,\"=\"&$AC$7))","v":""},{"$nulls":3},{"$f":"IF(SUMIFS(Register!$AL$10:$AL$1048576,Register!$AF$10:$AF$1048576,\">=\"&$C25,Register!$AF$10:$AF$1048576,\"<=\"&$H25,Register!$AB$10:$AB$1048576,\"=\"&$AG$7)=0,\"\",SUMIFS(Register!$AL$10:$AL$1048576,Register!$AF$10:$AF$1048576,\">=\"&$C25,Register!$AF$10:$AF$1048576,\"<=\"&$H25,Register!$AB$10:$AB$1048576,\"=\"&$AG$7))","v":""},{"$nulls":3},{"$f":"IF(SUMIFS(Register!$AL$10:$AL$1048576,Register!$AF$10:$AF$1048576,\">=\"&$C25,Register!$AF$10:$AF$1048576,\"<=\"&$H25,Register!$AB$10:$AB$1048576,\"=\"&$AK$7)=0,\"\",SUMIFS(Register!$AL$10:$AL$1048576,Register!$AF$10:$AF$1048576,\">=\"&$C25,Register!$AF$10:$AF$1048576,\"<=\"&$H25,Register!$AB$10:$AB$1048576,\"=\"&$AK$7))","v":""}]
[{"v":17,"d":"0017"},null,"2016-05-01",{"$nulls":4},"2016-05-31",{"$nulls":4},{"$f":"IF(SUMIFS(Register!$AL$10:$AL$1048576,Register!$AF$10:$AF$1048576,\">=\"&C26,Register!$AF$10:$AF$1048576,\"<=\"&H26)=0,\"\",SUMIFS(Register!$AL$10:$AL$1048576,Register!$AF$10:$AF$1048576,\">=\"&C26,Register!$AF$10:$AF$1048576,\"<=\"&H26))","v":""},{"$nulls":3},"",{"$nulls":3},{"$f":"IF(SUMIFS(Register!$AL$10:$AL$1048576,Register!$AF$10:$AF$1048576,\">=\"&$C26,Register!$AF$10:$AF$1048576,\"<=\"&$H26,Register!$AB$10:$AB$1048576,\"=\"&$U$7)=0,\"\",SUMIFS(Register!$AL$10:$AL$1048576,Register!$AF$10:$AF$1048576,\">=\"&$C26,Register!$AF$10:$AF$1048576,\"<=\"&$H26,Register!$AB$10:$AB$1048576,\"=\"&$U$7))","v":""},{"$nulls":3},{"$f":"IF(SUMIFS(Register!$AL$10:$AL$1048576,Register!$AF$10:$AF$1048576,\">=\"&$C26,Register!$AF$10:$AF$1048576,\"<=\"&$H26,Register!$AB$10:$AB$1048576,\"=\"&$Y$7)=0,\"\",SUMIFS(Register!$AL$10:$AL$1048576,Register!$AF$10:$AF$1048576,\">=\"&$C26,Register!$AF$10:$AF$1048576,\"<=\"&$H26,Register!$AB$10:$AB$1048576,\"=\"&$Y$7))","v":""},{"$nulls":3},{"$f":"IF(SUMIFS(Register!$AL$10:$AL$1048576,Register!$AF$10:$AF$1048576,\">=\"&$C26,Register!$AF$10:$AF$1048576,\"<=\"&$H26,Register!$AB$10:$AB$1048576,\"=\"&$AC$7)=0,\"\",SUMIFS(Register!$AL$10:$AL$1048576,Register!$AF$10:$AF$1048576,\">=\"&$C26,Register!$AF$10:$AF$1048576,\"<=\"&$H26,Register!$AB$10:$AB$1048576,\"=\"&$AC$7))","v":""},{"$nulls":3},{"$f":"IF(SUMIFS(Register!$AL$10:$AL$1048576,Register!$AF$10:$AF$1048576,\">=\"&$C26,Register!$AF$10:$AF$1048576,\"<=\"&$H26,Register!$AB$10:$AB$1048576,\"=\"&$AG$7)=0,\"\",SUMIFS(Register!$AL$10:$AL$1048576,Register!$AF$10:$AF$1048576,\">=\"&$C26,Register!$AF$10:$AF$1048576,\"<=\"&$H26,Register!$AB$10:$AB$1048576,\"=\"&$AG$7))","v":""},{"$nulls":3},{"$f":"IF(SUMIFS(Register!$AL$10:$AL$1048576,Register!$AF$10:$AF$1048576,\">=\"&$C26,Register!$AF$10:$AF$1048576,\"<=\"&$H26,Register!$AB$10:$AB$1048576,\"=\"&$AK$7)=0,\"\",SUMIFS(Register!$AL$10:$AL$1048576,Register!$AF$10:$AF$1048576,\">=\"&$C26,Register!$AF$10:$AF$1048576,\"<=\"&$H26,Register!$AB$10:$AB$1048576,\"=\"&$AK$7))","v":""}]
[{"v":18,"d":"0018"},null,"2016-06-01",{"$nulls":4},"2016-06-30",{"$nulls":4},{"$f":"IF(SUMIFS(Register!$AL$10:$AL$1048576,Register!$AF$10:$AF$1048576,\">=\"&C27,Register!$AF$10:$AF$1048576,\"<=\"&H27)=0,\"\",SUMIFS(Register!$AL$10:$AL$1048576,Register!$AF$10:$AF$1048576,\">=\"&C27,Register!$AF$10:$AF$1048576,\"<=\"&H27))","v":""},{"$nulls":3},"",{"$nulls":3},{"$f":"IF(SUMIFS(Register!$AL$10:$AL$1048576,Register!$AF$10:$AF$1048576,\">=\"&$C27,Register!$AF$10:$AF$1048576,\"<=\"&$H27,Register!$AB$10:$AB$1048576,\"=\"&$U$7)=0,\"\",SUMIFS(Register!$AL$10:$AL$1048576,Register!$AF$10:$AF$1048576,\">=\"&$C27,Register!$AF$10:$AF$1048576,\"<=\"&$H27,Register!$AB$10:$AB$1048576,\"=\"&$U$7))","v":""},{"$nulls":3},{"$f":"IF(SUMIFS(Register!$AL$10:$AL$1048576,Register!$AF$10:$AF$1048576,\">=\"&$C27,Register!$AF$10:$AF$1048576,\"<=\"&$H27,Register!$AB$10:$AB$1048576,\"=\"&$Y$7)=0,\"\",SUMIFS(Register!$AL$10:$AL$1048576,Register!$AF$10:$AF$1048576,\">=\"&$C27,Register!$AF$10:$AF$1048576,\"<=\"&$H27,Register!$AB$10:$AB$1048576,\"=\"&$Y$7))","v":""},{"$nulls":3},{"$f":"IF(SUMIFS(Register!$AL$10:$AL$1048576,Register!$AF$10:$AF$1048576,\">=\"&$C27,Register!$AF$10:$AF$1048576,\"<=\"&$H27,Register!$AB$10:$AB$1048576,\"=\"&$AC$7)=0,\"\",SUMIFS(Register!$AL$10:$AL$1048576,Register!$AF$10:$AF$1048576,\">=\"&$C27,Register!$AF$10:$AF$1048576,\"<=\"&$H27,Register!$AB$10:$AB$1048576,\"=\"&$AC$7))","v":""},{"$nulls":3},{"$f":"IF(SUMIFS(Register!$AL$10:$AL$1048576,Register!$AF$10:$AF$1048576,\">=\"&$C27,Register!$AF$10:$AF$1048576,\"<=\"&$H27,Register!$AB$10:$AB$1048576,\"=\"&$AG$7)=0,\"\",SUMIFS(Register!$AL$10:$AL$1048576,Register!$AF$10:$AF$1048576,\">=\"&$C27,Register!$AF$10:$AF$1048576,\"<=\"&$H27,Register!$AB$10:$AB$1048576,\"=\"&$AG$7))","v":""},{"$nulls":3},{"$f":"IF(SUMIFS(Register!$AL$10:$AL$1048576,Register!$AF$10:$AF$1048576,\">=\"&$C27,Register!$AF$10:$AF$1048576,\"<=\"&$H27,Register!$AB$10:$AB$1048576,\"=\"&$AK$7)=0,\"\",SUMIFS(Register!$AL$10:$AL$1048576,Register!$AF$10:$AF$1048576,\">=\"&$C27,Register!$AF$10:$AF$1048576,\"<=\"&$H27,Register!$AB$10:$AB$1048576,\"=\"&$AK$7))","v":""}]
[{"v":19,"d":"0019"},null,"2016-07-01",{"$nulls":4},"2016-07-31",{"$nulls":4},{"$f":"IF(SUMIFS(Register!$AL$10:$AL$1048576,Register!$AF$10:$AF$1048576,\">=\"&C28,Register!$AF$10:$AF$1048576,\"<=\"&H28)=0,\"\",SUMIFS(Register!$AL$10:$AL$1048576,Register!$AF$10:$AF$1048576,\">=\"&C28,Register!$AF$10:$AF$1048576,\"<=\"&H28))","v":""},{"$nulls":3},"",{"$nulls":3},{"$f":"IF(SUMIFS(Register!$AL$10:$AL$1048576,Register!$AF$10:$AF$1048576,\">=\"&$C28,Register!$AF$10:$AF$1048576,\"<=\"&$H28,Register!$AB$10:$AB$1048576,\"=\"&$U$7)=0,\"\",SUMIFS(Register!$AL$10:$AL$1048576,Register!$AF$10:$AF$1048576,\">=\"&$C28,Register!$AF$10:$AF$1048576,\"<=\"&$H28,Register!$AB$10:$AB$1048576,\"=\"&$U$7))","v":""},{"$nulls":3},{"$f":"IF(SUMIFS(Register!$AL$10:$AL$1048576,Register!$AF$10:$AF$1048576,\">=\"&$C28,Register!$AF$10:$AF$1048576,\"<=\"&$H28,Register!$AB$10:$AB$1048576,\"=\"&$Y$7)=0,\"\",SUMIFS(Register!$AL$10:$AL$1048576,Register!$AF$10:$AF$1048576,\">=\"&$C28,Register!$AF$10:$AF$1048576,\"<=\"&$H28,Register!$AB$10:$AB$1048576,\"=\"&$Y$7))","v":""},{"$nulls":3},{"$f":"IF(SUMIFS(Register!$AL$10:$AL$1048576,Register!$AF$10:$AF$1048576,\">=\"&$C28,Register!$AF$10:$AF$1048576,\"<=\"&$H28,Register!$AB$10:$AB$1048576,\"=\"&$AC$7)=0,\"\",SUMIFS(Register!$AL$10:$AL$1048576,Register!$AF$10:$AF$1048576,\">=\"&$C28,Register!$AF$10:$AF$1048576,\"<=\"&$H28,Register!$AB$10:$AB$1048576,\"=\"&$AC$7))","v":""},{"$nulls":3},{"$f":"IF(SUMIFS(Register!$AL$10:$AL$1048576,Register!$AF$10:$AF$1048576,\">=\"&$C28,Register!$AF$10:$AF$1048576,\"<=\"&$H28,Register!$AB$10:$AB$1048576,\"=\"&$AG$7)=0,\"\",SUMIFS(Register!$AL$10:$AL$1048576,Register!$AF$10:$AF$1048576,\">=\"&$C28,Register!$AF$10:$AF$1048576,\"<=\"&$H28,Register!$AB$10:$AB$1048576,\"=\"&$AG$7))","v":""},{"$nulls":3},{"$f":"IF(SUMIFS(Register!$AL$10:$AL$1048576,Register!$AF$10:$AF$1048576,\">=\"&$C28,Register!$AF$10:$AF$1048576,\"<=\"&$H28,Register!$AB$10:$AB$1048576,\"=\"&$AK$7)=0,\"\",SUMIFS(Register!$AL$10:$AL$1048576,Register!$AF$10:$AF$1048576,\">=\"&$C28,Register!$AF$10:$AF$1048576,\"<=\"&$H28,Register!$AB$10:$AB$1048576,\"=\"&$AK$7))","v":""}]
[{"v":20,"d":"0020"},null,"2016-08-01",{"$nulls":4},"2016-08-31",{"$nulls":4},{"$f":"IF(SUMIFS(Register!$AL$10:$AL$1048576,Register!$AF$10:$AF$1048576,\">=\"&C29,Register!$AF$10:$AF$1048576,\"<=\"&H29)=0,\"\",SUMIFS(Register!$AL$10:$AL$1048576,Register!$AF$10:$AF$1048576,\">=\"&C29,Register!$AF$10:$AF$1048576,\"<=\"&H29))","v":""},{"$nulls":3},"",{"$nulls":3},{"$f":"IF(SUMIFS(Register!$AL$10:$AL$1048576,Register!$AF$10:$AF$1048576,\">=\"&$C29,Register!$AF$10:$AF$1048576,\"<=\"&$H29,Register!$AB$10:$AB$1048576,\"=\"&$U$7)=0,\"\",SUMIFS(Register!$AL$10:$AL$1048576,Register!$AF$10:$AF$1048576,\">=\"&$C29,Register!$AF$10:$AF$1048576,\"<=\"&$H29,Register!$AB$10:$AB$1048576,\"=\"&$U$7))","v":""},{"$nulls":3},{"$f":"IF(SUMIFS(Register!$AL$10:$AL$1048576,Register!$AF$10:$AF$1048576,\">=\"&$C29,Register!$AF$10:$AF$1048576,\"<=\"&$H29,Register!$AB$10:$AB$1048576,\"=\"&$Y$7)=0,\"\",SUMIFS(Register!$AL$10:$AL$1048576,Register!$AF$10:$AF$1048576,\">=\"&$C29,Register!$AF$10:$AF$1048576,\"<=\"&$H29,Register!$AB$10:$AB$1048576,\"=\"&$Y$7))","v":""},{"$nulls":3},{"$f":"IF(SUMIFS(Register!$AL$10:$AL$1048576,Register!$AF$10:$AF$1048576,\">=\"&$C29,Register!$AF$10:$AF$1048576,\"<=\"&$H29,Register!$AB$10:$AB$1048576,\"=\"&$AC$7)=0,\"\",SUMIFS(Register!$AL$10:$AL$1048576,Register!$AF$10:$AF$1048576,\">=\"&$C29,Register!$AF$10:$AF$1048576,\"<=\"&$H29,Register!$AB$10:$AB$1048576,\"=\"&$AC$7))","v":""},{"$nulls":3},{"$f":"IF(SUMIFS(Register!$AL$10:$AL$1048576,Register!$AF$10:$AF$1048576,\">=\"&$C29,Register!$AF$10:$AF$1048576,\"<=\"&$H29,Register!$AB$10:$AB$1048576,\"=\"&$AG$7)=0,\"\",SUMIFS(Register!$AL$10:$AL$1048576,Register!$AF$10:$AF$1048576,\">=\"&$C29,Register!$AF$10:$AF$1048576,\"<=\"&$H29,Register!$AB$10:$AB$1048576,\"=\"&$AG$7))","v":""},{"$nulls":3},{"$f":"IF(SUMIFS(Register!$AL$10:$AL$1048576,Register!$AF$10:$AF$1048576,\">=\"&$C29,Register!$AF$10:$AF$1048576,\"<=\"&$H29,Register!$AB$10:$AB$1048576,\"=\"&$AK$7)=0,\"\",SUMIFS(Register!$AL$10:$AL$1048576,Register!$AF$10:$AF$1048576,\">=\"&$C29,Register!$AF$10:$AF$1048576,\"<=\"&$H29,Register!$AB$10:$AB$1048576,\"=\"&$AK$7))","v":""}]
[{"v":21,"d":"0021"},null,"2016-09-01",{"$nulls":4},"2016-09-30",{"$nulls":4},{"$f":"IF(SUMIFS(Register!$AL$10:$AL$1048576,Register!$AF$10:$AF$1048576,\">=\"&C30,Register!$AF$10:$AF$1048576,\"<=\"&H30)=0,\"\",SUMIFS(Register!$AL$10:$AL$1048576,Register!$AF$10:$AF$1048576,\">=\"&C30,Register!$AF$10:$AF$1048576,\"<=\"&H30))","v":""},{"$nulls":3},"",{"$nulls":3},{"$f":"IF(SUMIFS(Register!$AL$10:$AL$1048576,Register!$AF$10:$AF$1048576,\">=\"&$C30,Register!$AF$10:$AF$1048576,\"<=\"&$H30,Register!$AB$10:$AB$1048576,\"=\"&$U$7)=0,\"\",SUMIFS(Register!$AL$10:$AL$1048576,Register!$AF$10:$AF$1048576,\">=\"&$C30,Register!$AF$10:$AF$1048576,\"<=\"&$H30,Register!$AB$10:$AB$1048576,\"=\"&$U$7))","v":""},{"$nulls":3},{"$f":"IF(SUMIFS(Register!$AL$10:$AL$1048576,Register!$AF$10:$AF$1048576,\">=\"&$C30,Register!$AF$10:$AF$1048576,\"<=\"&$H30,Register!$AB$10:$AB$1048576,\"=\"&$Y$7)=0,\"\",SUMIFS(Register!$AL$10:$AL$1048576,Register!$AF$10:$AF$1048576,\">=\"&$C30,Register!$AF$10:$AF$1048576,\"<=\"&$H30,Register!$AB$10:$AB$1048576,\"=\"&$Y$7))","v":""},{"$nulls":3},{"$f":"IF(SUMIFS(Register!$AL$10:$AL$1048576,Register!$AF$10:$AF$1048576,\">=\"&$C30,Register!$AF$10:$AF$1048576,\"<=\"&$H30,Register!$AB$10:$AB$1048576,\"=\"&$AC$7)=0,\"\",SUMIFS(Register!$AL$10:$AL$1048576,Register!$AF$10:$AF$1048576,\">=\"&$C30,Register!$AF$10:$AF$1048576,\"<=\"&$H30,Register!$AB$10:$AB$1048576,\"=\"&$AC$7))","v":""},{"$nulls":3},{"$f":"IF(SUMIFS(Register!$AL$10:$AL$1048576,Register!$AF$10:$AF$1048576,\">=\"&$C30,Register!$AF$10:$AF$1048576,\"<=\"&$H30,Register!$AB$10:$AB$1048576,\"=\"&$AG$7)=0,\"\",SUMIFS(Register!$AL$10:$AL$1048576,Register!$AF$10:$AF$1048576,\">=\"&$C30,Register!$AF$10:$AF$1048576,\"<=\"&$H30,Register!$AB$10:$AB$1048576,\"=\"&$AG$7))","v":""},{"$nulls":3},{"$f":"IF(SUMIFS(Register!$AL$10:$AL$1048576,Register!$AF$10:$AF$1048576,\">=\"&$C30,Register!$AF$10:$AF$1048576,\"<=\"&$H30,Register!$AB$10:$AB$1048576,\"=\"&$AK$7)=0,\"\",SUMIFS(Register!$AL$10:$AL$1048576,Register!$AF$10:$AF$1048576,\">=\"&$C30,Register!$AF$10:$AF$1048576,\"<=\"&$H30,Register!$AB$10:$AB$1048576,\"=\"&$AK$7))","v":""}]
[{"v":22,"d":"0022"},null,"2016-10-01",{"$nulls":4},"2016-10-31",{"$nulls":4},{"$f":"IF(SUMIFS(Register!$AL$10:$AL$1048576,Register!$AF$10:$AF$1048576,\">=\"&C31,Register!$AF$10:$AF$1048576,\"<=\"&H31)=0,\"\",SUMIFS(Register!$AL$10:$AL$1048576,Register!$AF$10:$AF$1048576,\">=\"&C31,Register!$AF$10:$AF$1048576,\"<=\"&H31))","v":""},{"$nulls":3},"",{"$nulls":3},{"$f":"IF(SUMIFS(Register!$AL$10:$AL$1048576,Register!$AF$10:$AF$1048576,\">=\"&$C31,Register!$AF$10:$AF$1048576,\"<=\"&$H31,Register!$AB$10:$AB$1048576,\"=\"&$U$7)=0,\"\",SUMIFS(Register!$AL$10:$AL$1048576,Register!$AF$10:$AF$1048576,\">=\"&$C31,Register!$AF$10:$AF$1048576,\"<=\"&$H31,Register!$AB$10:$AB$1048576,\"=\"&$U$7))","v":""},{"$nulls":3},{"$f":"IF(SUMIFS(Register!$AL$10:$AL$1048576,Register!$AF$10:$AF$1048576,\">=\"&$C31,Register!$AF$10:$AF$1048576,\"<=\"&$H31,Register!$AB$10:$AB$1048576,\"=\"&$Y$7)=0,\"\",SUMIFS(Register!$AL$10:$AL$1048576,Register!$AF$10:$AF$1048576,\">=\"&$C31,Register!$AF$10:$AF$1048576,\"<=\"&$H31,Register!$AB$10:$AB$1048576,\"=\"&$Y$7))","v":""},{"$nulls":3},{"$f":"IF(SUMIFS(Register!$AL$10:$AL$1048576,Register!$AF$10:$AF$1048576,\">=\"&$C31,Register!$AF$10:$AF$1048576,\"<=\"&$H31,Register!$AB$10:$AB$1048576,\"=\"&$AC$7)=0,\"\",SUMIFS(Register!$AL$10:$AL$1048576,Register!$AF$10:$AF$1048576,\">=\"&$C31,Register!$AF$10:$AF$1048576,\"<=\"&$H31,Register!$AB$10:$AB$1048576,\"=\"&$AC$7))","v":""},{"$nulls":3},{"$f":"IF(SUMIFS(Register!$AL$10:$AL$1048576,Register!$AF$10:$AF$1048576,\">=\"&$C31,Register!$AF$10:$AF$1048576,\"<=\"&$H31,Register!$AB$10:$AB$1048576,\"=\"&$AG$7)=0,\"\",SUMIFS(Register!$AL$10:$AL$1048576,Register!$AF$10:$AF$1048576,\">=\"&$C31,Register!$AF$10:$AF$1048576,\"<=\"&$H31,Register!$AB$10:$AB$1048576,\"=\"&$AG$7))","v":""},{"$nulls":3},{"$f":"IF(SUMIFS(Register!$AL$10:$AL$1048576,Register!$AF$10:$AF$1048576,\">=\"&$C31,Register!$AF$10:$AF$1048576,\"<=\"&$H31,Register!$AB$10:$AB$1048576,\"=\"&$AK$7)=0,\"\",SUMIFS(Register!$AL$10:$AL$1048576,Register!$AF$10:$AF$1048576,\">=\"&$C31,Register!$AF$10:$AF$1048576,\"<=\"&$H31,Register!$AB$10:$AB$1048576,\"=\"&$AK$7))","v":""}]
[{"v":23,"d":"0023"},null,{"$f":"EDATE(C31,1)","v":"2016-11-01"},{"$nulls":4},{"$f":"EDATE(C32,1)-1","v":"2016-11-30"},{"$nulls":4},{"$f":"IF(SUMIFS(Register!$AL$10:$AL$1048576,Register!$AF$10:$AF$1048576,\">=\"&C32,Register!$AF$10:$AF$1048576,\"<=\"&H32)=0,\"\",SUMIFS(Register!$AL$10:$AL$1048576,Register!$AF$10:$AF$1048576,\">=\"&C32,Register!$AF$10:$AF$1048576,\"<=\"&H32))","v":""},{"$nulls":3},"",{"$nulls":3},{"$f":"IF(SUMIFS(Register!$AL$10:$AL$1048576,Register!$AF$10:$AF$1048576,\">=\"&$C32,Register!$AF$10:$AF$1048576,\"<=\"&$H32,Register!$AB$10:$AB$1048576,\"=\"&$U$7)=0,\"\",SUMIFS(Register!$AL$10:$AL$1048576,Register!$AF$10:$AF$1048576,\">=\"&$C32,Register!$AF$10:$AF$1048576,\"<=\"&$H32,Register!$AB$10:$AB$1048576,\"=\"&$U$7))","v":""},{"$nulls":3},{"$f":"IF(SUMIFS(Register!$AL$10:$AL$1048576,Register!$AF$10:$AF$1048576,\">=\"&$C32,Register!$AF$10:$AF$1048576,\"<=\"&$H32,Register!$AB$10:$AB$1048576,\"=\"&$Y$7)=0,\"\",SUMIFS(Register!$AL$10:$AL$1048576,Register!$AF$10:$AF$1048576,\">=\"&$C32,Register!$AF$10:$AF$1048576,\"<=\"&$H32,Register!$AB$10:$AB$1048576,\"=\"&$Y$7))","v":""},{"$nulls":3},{"$f":"IF(SUMIFS(Register!$AL$10:$AL$1048576,Register!$AF$10:$AF$1048576,\">=\"&$C32,Register!$AF$10:$AF$1048576,\"<=\"&$H32,Register!$AB$10:$AB$1048576,\"=\"&$AC$7)=0,\"\",SUMIFS(Register!$AL$10:$AL$1048576,Register!$AF$10:$AF$1048576,\">=\"&$C32,Register!$AF$10:$AF$1048576,\"<=\"&$H32,Register!$AB$10:$AB$1048576,\"=\"&$AC$7))","v":""},{"$nulls":3},{"$f":"IF(SUMIFS(Register!$AL$10:$AL$1048576,Register!$AF$10:$AF$1048576,\">=\"&$C32,Register!$AF$10:$AF$1048576,\"<=\"&$H32,Register!$AB$10:$AB$1048576,\"=\"&$AG$7)=0,\"\",SUMIFS(Register!$AL$10:$AL$1048576,Register!$AF$10:$AF$1048576,\">=\"&$C32,Register!$AF$10:$AF$1048576,\"<=\"&$H32,Register!$AB$10:$AB$1048576,\"=\"&$AG$7))","v":""},{"$nulls":3},{"$f":"IF(SUMIFS(Register!$AL$10:$AL$1048576,Register!$AF$10:$AF$1048576,\">=\"&$C32,Register!$AF$10:$AF$1048576,\"<=\"&$H32,Register!$AB$10:$AB$1048576,\"=\"&$AK$7)=0,\"\",SUMIFS(Register!$AL$10:$AL$1048576,Register!$AF$10:$AF$1048576,\">=\"&$C32,Register!$AF$10:$AF$1048576,\"<=\"&$H32,Register!$AB$10:$AB$1048576,\"=\"&$AK$7))","v":""}]
[{"v":24,"d":"0024"},null,"2016-12-01",{"$nulls":4},"2016-12-31",{"$nulls":4},{"$f":"IF(SUMIFS(Register!$AL$10:$AL$1048576,Register!$AF$10:$AF$1048576,\">=\"&C33,Register!$AF$10:$AF$1048576,\"<=\"&H33)=0,\"\",SUMIFS(Register!$AL$10:$AL$1048576,Register!$AF$10:$AF$1048576,\">=\"&C33,Register!$AF$10:$AF$1048576,\"<=\"&H33))","v":""},{"$nulls":3},"",{"$nulls":3},{"$f":"IF(SUMIFS(Register!$AL$10:$AL$1048576,Register!$AF$10:$AF$1048576,\">=\"&$C33,Register!$AF$10:$AF$1048576,\"<=\"&$H33,Register!$AB$10:$AB$1048576,\"=\"&$U$7)=0,\"\",SUMIFS(Register!$AL$10:$AL$1048576,Register!$AF$10:$AF$1048576,\">=\"&$C33,Register!$AF$10:$AF$1048576,\"<=\"&$H33,Register!$AB$10:$AB$1048576,\"=\"&$U$7))","v":""},{"$nulls":3},{"$f":"IF(SUMIFS(Register!$AL$10:$AL$1048576,Register!$AF$10:$AF$1048576,\">=\"&$C33,Register!$AF$10:$AF$1048576,\"<=\"&$H33,Register!$AB$10:$AB$1048576,\"=\"&$Y$7)=0,\"\",SUMIFS(Register!$AL$10:$AL$1048576,Register!$AF$10:$AF$1048576,\">=\"&$C33,Register!$AF$10:$AF$1048576,\"<=\"&$H33,Register!$AB$10:$AB$1048576,\"=\"&$Y$7))","v":""},{"$nulls":3},{"$f":"IF(SUMIFS(Register!$AL$10:$AL$1048576,Register!$AF$10:$AF$1048576,\">=\"&$C33,Register!$AF$10:$AF$1048576,\"<=\"&$H33,Register!$AB$10:$AB$1048576,\"=\"&$AC$7)=0,\"\",SUMIFS(Register!$AL$10:$AL$1048576,Register!$AF$10:$AF$1048576,\">=\"&$C33,Register!$AF$10:$AF$1048576,\"<=\"&$H33,Register!$AB$10:$AB$1048576,\"=\"&$AC$7))","v":""},{"$nulls":3},{"$f":"IF(SUMIFS(Register!$AL$10:$AL$1048576,Register!$AF$10:$AF$1048576,\">=\"&$C33,Register!$AF$10:$AF$1048576,\"<=\"&$H33,Register!$AB$10:$AB$1048576,\"=\"&$AG$7)=0,\"\",SUMIFS(Register!$AL$10:$AL$1048576,Register!$AF$10:$AF$1048576,\">=\"&$C33,Register!$AF$10:$AF$1048576,\"<=\"&$H33,Register!$AB$10:$AB$1048576,\"=\"&$AG$7))","v":""},{"$nulls":3},{"$f":"IF(SUMIFS(Register!$AL$10:$AL$1048576,Register!$AF$10:$AF$1048576,\">=\"&$C33,Register!$AF$10:$AF$1048576,\"<=\"&$H33,Register!$AB$10:$AB$1048576,\"=\"&$AK$7)=0,\"\",SUMIFS(Register!$AL$10:$AL$1048576,Register!$AF$10:$AF$1048576,\">=\"&$C33,Register!$AF$10:$AF$1048576,\"<=\"&$H33,Register!$AB$10:$AB$1048576,\"=\"&$AK$7))","v":""}]
[{"$nulls":12},"Total:",{"$nulls":3},{"$f":"SUM(Q10:T33)","v":{"v":198,"d":"198.0m3"}},{"$nulls":3},{"$f":"SUM(U10:X33)","v":{"v":38,"d":"38.0m3"}},{"$nulls":3},{"$f":"SUM(Y10:AB33)","v":{"v":38,"d":"38.0m3"}},{"$nulls":3},{"$f":"SUM(AC10:AF33)","v":{"v":38,"d":"38.0m3"}},{"$nulls":3},{"$f":"SUM(AG10:AJ33)","v":{"v":38,"d":"38.0m3"}},{"$nulls":3},{"$f":"SUM(AK10:AN33)","v":{"v":46,"d":"46.0m3"}}]

{"sheet":"Supplier","index":4,"n_rows":5,"n_cols":1,"rows_kept":5}
["Supplier A"]
["Supplier B"]
["Supplier C"]
["Supplier D"]
["Supplier E"]

{"sheet":"Cube ID","index":5,"n_rows":18,"n_cols":9,"rows_kept":18,"merged":[[0,0,0,1],[0,2,0,3],[0,4,0,5],[0,6,0,7],[0,8,17,11]]}
[{"$f":"IF('[1]WBS ID'!A2=0,\"\",'[1]WBS ID'!A2)","v":"Location"},null,"Area",null,{"$f":"IF('[1]WBS ID'!E2=0,\"\",'[1]WBS ID'!E2)","v":"Item"},null,"Narration",null,"This table technically is without function and just provides a sample how to build a cube ID."]
["B1","Building 1","GN","Site/General",{"$f":"IF('[1]WBS ID'!E3=0,\"\",'[1]WBS ID'!E3)","v":"CL"},"Column","A1:B5","here Gridline A1 - B5"]
["B2","Building 2","BM","Basement",{"$f":"IF('[1]WBS ID'!E4=0,\"\",'[1]WBS ID'!E4)","v":"GB"},"Ground Beam","…"]
["B3","Building 3","GF","Groundfloor",{"$f":"IF('[1]WBS ID'!E5=0,\"\",'[1]WBS ID'!E5)","v":"IB"},"Intermediate Beam"]
["GN","General","MF","Mezzanine Floor","SL","Slab"]
[null,null,"F1","Floor 1","WA","Wall"]
[null,null,{"$f":"IF('[1]WBS ID'!C8=0,\"\",'[1]WBS ID'!C8)","v":"…"}]
[null,null,"F11","Floor 11"]
[null,null,"RF","Roof"]
[null,null,{"$f":"IF('[1]WBS ID'!C11=0,\"\",'[1]WBS ID'!C11)","v":""}]
[{"$f":"IF('[1]WBS ID'!A12=0,\"\",'[1]WBS ID'!A12)","v":""},null,{"$f":"IF('[1]WBS ID'!C12=0,\"\",'[1]WBS ID'!C12)","v":""},null,{"$f":"IF('[1]WBS ID'!E12=0,\"\",'[1]WBS ID'!E12)","v":"GN"}]
[{"$f":"IF('[1]WBS ID'!A13=0,\"\",'[1]WBS ID'!A13)","v":""},null,{"$f":"IF('[1]WBS ID'!C13=0,\"\",'[1]WBS ID'!C13)","v":""},null,{"$f":"IF('[1]WBS ID'!E13=0,\"\",'[1]WBS ID'!E13)","v":""}]
[{"$f":"IF('[1]WBS ID'!A14=0,\"\",'[1]WBS ID'!A14)","v":""},null,{"$f":"IF('[1]WBS ID'!C14=0,\"\",'[1]WBS ID'!C14)","v":""},null,{"$f":"IF('[1]WBS ID'!E14=0,\"\",'[1]WBS ID'!E14)","v":""}]
[{"$f":"IF('[1]WBS ID'!A15=0,\"\",'[1]WBS ID'!A15)","v":""},null,{"$f":"IF('[1]WBS ID'!C15=0,\"\",'[1]WBS ID'!C15)","v":""},null,{"$f":"IF('[1]WBS ID'!E15=0,\"\",'[1]WBS ID'!E15)","v":""}]
[{"$f":"IF('[1]WBS ID'!A16=0,\"\",'[1]WBS ID'!A16)","v":""},null,{"$f":"IF('[1]WBS ID'!C16=0,\"\",'[1]WBS ID'!C16)","v":""},null,{"$f":"IF('[1]WBS ID'!E16=0,\"\",'[1]WBS ID'!E16)","v":""}]
[{"$f":"IF('[1]WBS ID'!A17=0,\"\",'[1]WBS ID'!A17)","v":""},null,{"$f":"IF('[1]WBS ID'!C17=0,\"\",'[1]WBS ID'!C17)","v":""},null,{"$f":"IF('[1]WBS ID'!E17=0,\"\",'[1]WBS ID'!E17)","v":""}]
[{"$f":"IF('[1]WBS ID'!A18=0,\"\",'[1]WBS ID'!A18)","v":""},null,{"$f":"IF('[1]WBS ID'!C18=0,\"\",'[1]WBS ID'!C18)","v":""},null,{"$f":"IF('[1]WBS ID'!E18=0,\"\",'[1]WBS ID'!E18)","v":""}]
[{"$f":"IF('[1]WBS ID'!A19=0,\"\",'[1]WBS ID'!A19)","v":""},null,{"$f":"IF('[1]WBS ID'!C19=0,\"\",'[1]WBS ID'!C19)","v":""},null,{"$f":"IF('[1]WBS ID'!E19=0,\"\",'[1]WBS ID'!E19)","v":""}]